harmony-alerts mailing list archives

Site index · List index
Message view « Date » · « Thread »
Top « Date » · « Thread »
From nom...@intel.com
Subject [build-test alert] FAILED Linux x86: hdk debug
Date Fri, 21 Nov 2008 22:07:31 GMT

BUILD FAILED:
	Ant Error Message:
/home/laichunrong/harmony.regularcc/infra/scripts/cc-exec-adaptor.xml:68: The following error
occurred while executing this line: /home/laichunrong/harmony.regularcc/infra/adaptors/hdk/adaptor.xml:39:
The following error occurred while executing this line: /home/laichunrong/harmony.regularcc/infra/scripts/framework.xml:163:
Java returned: 1

Date of build:	2008-11-22 06:03:50 +0800
Time to build:	2 minutes 45 seconds
Last changed:	11/22/2008 00:42:48
Last log entry:	Start to tidy up the network interface.
First part of removing redundant methods and adopting sensible names.

***********************************************************
Errors/Warnings:	(6)
            
BUILD FAILED
/home/laichunrong/harmony.regularcc/infra/build/checkouts/hdk/build.xml:401: The following
error occurred while executing this line:
/home/laichunrong/harmony.regularcc/infra/build/checkouts/hdk/working_classlib/build.xml:113:
The following error occurred while executing this line:
/home/laichunrong/harmony.regularcc/infra/build/checkouts/hdk/working_classlib/make/build-java.xml:120:
Compile failed; see the compiler error output for details.
Total time: 1 minute 29 seconds
The execution FAILED with the following exception:
The following error occurred while executing this line:
/home/laichunrong/harmony.regularcc/infra/adaptors/hdk/adaptor.xml:39: The following error
occurred while executing this line:
/home/laichunrong/harmony.regularcc/infra/scripts/framework.xml:163: Java returned: 1

***********************************************************
Unit Tests: (0)
        
No Tests Run: This project doesn't have any tests

***********************************************************
Modifications since last successful build:	(6)
            
modified tellison  /harmony/enhanced/classlib/trunk/modules/luni/src/main/native/luni/shared/OSNetworkSystem.h
11/22/2008 00:42:48 Start to tidy up the network interface.First part of removing redundant
methods and adopting sensible names.
modified tellison  /harmony/enhanced/classlib/trunk/modules/luni/src/main/native/luni/windows/OSNetworkSystemWin32.c
11/22/2008 00:42:48 Start to tidy up the network interface.First part of removing redundant
methods and adopting sensible names.
modified tellison  /harmony/enhanced/classlib/trunk/modules/luni/src/main/java/org/apache/harmony/luni/platform/OSNetworkSystem.java
11/22/2008 00:42:48 Start to tidy up the network interface.First part of removing redundant
methods and adopting sensible names.
modified tellison  /harmony/enhanced/classlib/trunk/modules/luni/src/main/native/luni/unix/OSNetworkSystemLinux.c
11/22/2008 00:42:48 Start to tidy up the network interface.First part of removing redundant
methods and adopting sensible names.
modified tellison  /harmony/enhanced/classlib/trunk/modules/luni/src/main/native/luni/unix/exports.txt
11/22/2008 00:42:48 Start to tidy up the network interface.First part of removing redundant
methods and adopting sensible names.
modified tellison  /harmony/enhanced/classlib/trunk/modules/luni/src/main/native/luni/shared/OSNetworkSystem.c
11/22/2008 00:42:48 Start to tidy up the network interface.First part of removing redundant
methods and adopting sensible names.


Mime
  • Unnamed multipart/mixed (inline, None, 0 bytes)
View raw message