harmony-alerts mailing list archives

Site index · List index
Message view « Date » · « Thread »
Top « Date » · « Thread »
From nom...@intel.com
Subject [build-test alert] FAILED Linux x86: drlvm-test debug
Date Tue, 18 Nov 2008 00:03:44 GMT

BUILD FAILED:
	Ant Error Message:
/home/laichunrong/harmony.regularcc/infra/scripts/cc-exec-adaptor.xml:68: The following error
occurred while executing this line: /home/laichunrong/harmony.regularcc/infra/adaptors/drlvm-test/adaptor.xml:81:
There were drlvm-test failures

Date of build:	2008-11-18 03:37:25 +0800
Time to build:	266 minutes 14 seconds
Last changed:	11/18/2008 02:36:42
Last log entry:	hdk

***********************************************************
Errors/Warnings:	(21)
            
[java] Java Result: 1
[java] Java Result: 1
[java] Java Result: 130
[java] Java Result: 1
[java] Java Result: 1
[java] Java Result: 130
[java] Java Result: 134
[java] Java Result: 1
[java] Java Result: 1
[java] Java Result: 130
[java] Java Result: 1
[java] Java Result: 1
[java] Java Result: 130
[java] Java Result: 1
[java] Java Result: 1
[java] Java Result: 130
BUILD FAILED
/home/laichunrong/harmony.regularcc/infra/build/checkouts/hdk/working_vm/build.xml:286: Some
tests failed
Total time: 265 minutes 56 seconds
The execution FAILED with the following exception:
The following error occurred while executing this line:
/home/laichunrong/harmony.regularcc/infra/adaptors/drlvm-test/adaptor.xml:81: There were drlvm-test
failures

***********************************************************
Unit Tests: (4185)
        
failure: jitrino.JET stress.Intern_jet
Unit Test Error Details:	(1)
                
Test: jitrino.JETClass: stress.Intern_jetExit code: 134 Err: java: /home/laichunrong/harmony.regularcc/infra/build/checkouts/hdk/working_vm/vm/gc_gen/src/semi_space/sspace.cpp:309:
sspace_reset_after_collection: Assertion `0' failed.

Signal reported: ABORT

Registers info is absent

Command line:
/home/laichunrong/harmony.regularcc/infra/build/checkouts/hdk/target/hdk/jdk/jre/bin/java
-Xem:jet -XX:-vm.assert_dialog -Djava.library.path=/home/laichunrong/harmony.regularcc/infra/build/checkouts/hdk/working_vm/build/linux_x86_gcc_debug/tests/smoke.tests/natives/stress
-classpath /home/laichunrong/harmony.regularcc/infra/build/checkouts/hdk/working_vm/build/linux_x86_gcc_debug/tests/smoke.tests/classes
stress.Intern 

Working directory:
/home/laichunrong/harmony.regularcc/infra/build/checkouts/hdk/working_vm/build/linux_x86_gcc_debug/tests/smoke.tests

Environment variables:
JAVA_HOME=/home/laichunrong/harmony.regularcc/infra/build/checkouts/hdk/target/hdk/jdk/jre
LD_LIBRARY_PATH=/home/laichunrong/harmony.regularcc/infra/build/checkouts/hdk/target/hdk/jdk/jre/bin/default:/home/laichunrong/harmony.regularcc/infra/build/checkouts/hdk/target/hdk/jdk/jre/bin/:/home/laichunrong/harmony.regularcc/infra/build/checkouts/hdk/target/hdk/jdk/jre/bin:/opt/jdk1.5.0_07/jre/lib/i386/client:/opt/jdk1.5.0_07/jre/lib/i386:/opt/jdk1.5.0_07/jre/../lib/i386

Loaded modules:

/home/laichunrong/harmony.regularcc/infra/build/checkouts/hdk/target/hdk/jdk/jre/bin/java:
	0x08048000:0x0804d000
	0x0804d000:0x0804e000
/lib/ld-2.6.so:
	0x45b68000:0x45b83000
	0x45b83000:0x45b84000
	0x45b84000:0x45b85000
/lib/librt-2.6.so:
	0x45b87000:0x45b8e000
	0x45b8e000:0x45b8f000
	0x45b8f000:0x45b90000
/lib/libc-2.6.so:
	0x46539000:0x46687000
	0x46687000:0x46689000
	0x46689000:0x4668a000
/lib/libm-2.6.so:
	0x4668f000:0x466b6000
	0x466b6000:0x466b7000
	0x466b7000:0x466b8000
/lib/libdl-2.6.so:
	0x466ba000:0x466bd000
	0x466bd000:0x466be000
	0x466be000:0x466bf000
/lib/libz.so.1.2.3:
	0x466c1000:0x466d3000
	0x466d3000:0x466d4000
/lib/libpthread-2.6.so:
	0x46777000:0x4678b000
	0x4678b000:0x4678c000
	0x4678c000:0x4678d000
/usr/lib/libxml2.so.2.6.28:
	0x46f9f000:0x470cc000
	0x470cc000:0x470d1000
/lib/libgcc_s-4.1.2-20070503.so.1:
	0x4711f000:0x4712a000
	0x4712a000:0x4712b000
/usr/lib/libstdc++.so.6.0.8:
	0x4712d000:0x4720d000
	0x4720d000:0x47210000
	0x47210000:0x47212000
/home/laichunrong/harmony.regularcc/infra/build/checkouts/hdk/target/hdk/jdk/jre/bin/libhyniochar.so:
	0x96087000:0x961d8000
	0x961d8000:0x96200000
/home/laichunrong/harmony.regularcc/infra/build/checkouts/hdk/target/hdk/jdk/jre/bin/libhyluni.so:
	0x963a7000:0x963d8000
	0x963d8000:0x963d9000
/home/laichunrong/harmony.regularcc/infra/build/checkouts/hdk/target/hdk/jdk/jre/bin/libhyzlib.so:
	0x963d9000:0x963e9000
	0x963e9000:0x963ea000
/home/laichunrong/harmony.regularcc/infra/build/checkouts/hdk/target/hdk/jdk/jre/bin/default/libgc_gen_uncomp.so:
	0xb67f6000:0xb6896000
	0xb6896000:0xb6898000
/home/laichunrong/harmony.regularcc/infra/build/checkouts/hdk/target/hdk/jdk/jre/bin/default/libjitrino.so:
	0xb6899000:0xb6c2b000
	0xb6c2b000:0xb6c38000
/home/laichunrong/harmony.regularcc/infra/build/checkouts/hdk/target/hdk/jdk/jre/bin/default/libem.so:
	0xb6c9c000:0xb6cd4000
	0xb6cd4000:0xb6cd5000
/lib/libnss_files-2.6.so:
	0xb6d55000:0xb6d5f000
	0xb6d5f000:0xb6d60000
	0xb6d60000:0xb6d61000
/home/laichunrong/harmony.regularcc/infra/build/checkouts/hdk/target/hdk/jdk/jre/bin/libhyarchive.so:
	0xb6d64000:0xb6d70000
	0xb6d70000:0xb6d71000
/home/laichunrong/harmony.regularcc/infra/build/checkouts/hdk/target/hdk/jdk/jre/bin/default/libicudata.so.34:
	0xb6e95000:0xb7709000
	0xb7709000:0xb770a000
/home/laichunrong/harmony.regularcc/infra/build/checkouts/hdk/target/hdk/jdk/jre/bin/default/libicuuc.so.34:
	0xb770a000:0xb780b000
	0xb780b000:0xb7813000
/home/laichunrong/harmony.regularcc/infra/build/checkouts/hdk/target/hdk/jdk/jre/bin/default/libharmonyvm.so:
	0xb7813000:0xb79f8000
	0xb79f8000:0xb7a5b000
/home/laichunrong/harmony.regularcc/infra/build/checkouts/hdk/target/hdk/jdk/jre/bin/default/libch.so:
	0xb7c92000:0xb7ca2000
	0xb7ca2000:0xb7d00000
/home/laichunrong/harmony.regularcc/infra/build/checkouts/hdk/target/hdk/jdk/jre/bin/default/libvmi.so:
	0xb7f3f000:0xb7f44000
	0xb7f44000:0xb7f45000
/home/laichunrong/harmony.regularcc/infra/build/checkouts/hdk/target/hdk/jdk/jre/bin/libhynio.so:
	0xb7f45000:0xb7f47000
	0xb7f47000:0xb7f48000
/home/laichunrong/harmony.regularcc/infra/build/checkouts/hdk/target/hdk/jdk/jre/bin/libhyprt.so:
	0xb7f48000:0xb7f60000
	0xb7f60000:0xb7f64000
/home/laichunrong/harmony.regularcc/infra/build/checkouts/hdk/target/hdk/jdk/jre/bin/libhythr.so:
	0xb7f64000:0xb7f84000
	0xb7f84000:0xb7f85000
[vdso]:
	0xb7fb6000:0xb7fb7000
[stack]:
	0xbf3a6000:0xbfd94000

No stack trace due to registers info absence

***********************************************************
Modifications since last successful build:	(1)
            
add cc-hdk log20081118023642Lbuild.215 11/18/2008 02:36:42hdk


Mime
  • Unnamed multipart/mixed (inline, None, 0 bytes)
View raw message