harmony-alerts mailing list archives

Site index · List index
Message view « Date » · « Thread »
Top « Date » · « Thread »
From nom...@intel.com
Subject [build-test alert] FAILED Windows 2003 x86_64: make-snapshot debug
Date Tue, 21 Oct 2008 19:50:33 GMT

BUILD FAILED:
	Ant Error Message:
C:\harmony.cc\infra\scripts\cc-exec-adaptor.xml:68: The following error occurred while executing
this line: C:\harmony.cc\infra\adaptors\make-snapshot\adaptor.xml:41: The following error
occurred while executing this line: C:\harmony.cc\infra\scripts\framework.xml:163: Java returned:
1

Date of build:	2008-10-21 12:46:27 -0700
Time to build:	4 minutes 0 seconds
Last changed:	10/21/2008 03:05:22
Last log entry:	

***********************************************************
Errors/Warnings:	(5)
            
Checkout HDK trunk -r706374 into c:/make-snapshot
BUILD FAILED
C:\make-snapshot\build.xml:536: Unable to delete directory C:\harmony.cc\infra\build\results\make-snapshot
Total time: 1 minute 45 seconds
The execution FAILED with the following exception:
The following error occurred while executing this line:
C:\harmony.cc\infra\adaptors\make-snapshot\adaptor.xml:41: The following error occurred while
executing this line:
C:\harmony.cc\infra\scripts\framework.xml:163: Java returned: 1

***********************************************************
Unit Tests: (0)
        
No Tests Run: This project doesn't have any tests

***********************************************************
Modifications since last successful build:	(1)
            
change  c:\make-snapshot/ release.properties 10/21/2008 03:05:22 


Mime
  • Unnamed multipart/mixed (inline, None, 0 bytes)
View raw message