harmony-alerts mailing list archives

Site index · List index
Message view « Date » · « Thread »
Top « Date » · « Thread »
From nom...@intel.com
Subject [build-test alert] FAILED Windows 2003 x86_64: hdk debug
Date Tue, 28 Oct 2008 07:07:34 GMT

BUILD FAILED:
	Ant Error Message:
C:\harmony.cc\infra\scripts\cc-exec-adaptor.xml:68: The following error occurred while executing
this line: C:\harmony.cc\infra\adaptors\hdk\adaptor.xml:39: The following error occurred while
executing this line: C:\harmony.cc\infra\scripts\framework.xml:163: Java returned: 1

Date of build:	2008-10-27 23:37:16 -0700
Time to build:	28 minutes 56 seconds
Last changed:	10/27/2008 08:40:46
Last log entry:	Javadoc spelling fixes

***********************************************************
Errors/Warnings:	(40)
            
[cc] cl : Command line warning D9035 : option 'GZ' has been deprecated and will be removed
in a future release
[cc] cl : Command line warning D9036 : use 'RTC1' instead of 'GZ'
[cc] cl : Command line warning D9035 : option 'GZ' has been deprecated and will be removed
in a future release
[cc] cl : Command line warning D9036 : use 'RTC1' instead of 'GZ'
[compile-cc] cl : Command line warning D9035 : option 'GZ' has been deprecated and will be
removed in a future release
[compile-cc] cl : Command line warning D9036 : use 'RTC1' instead of 'GZ'
[compile-cc] cl : Command line warning D9035 : option 'GZ' has been deprecated and will be
removed in a future release
[compile-cc] cl : Command line warning D9036 : use 'RTC1' instead of 'GZ'
[compile-cc] cl : Command line warning D9035 : option 'GZ' has been deprecated and will be
removed in a future release
[compile-cc] cl : Command line warning D9036 : use 'RTC1' instead of 'GZ'
[compile-cc] cl : Command line warning D9035 : option 'GZ' has been deprecated and will be
removed in a future release
[compile-cc] cl : Command line warning D9036 : use 'RTC1' instead of 'GZ'
[cc] cl : Command line warning D9035 : option 'GZ' has been deprecated and will be removed
in a future release
[cc] cl : Command line warning D9036 : use 'RTC1' instead of 'GZ'
[cc] cl : Command line warning D9035 : option 'GZ' has been deprecated and will be removed
in a future release
[cc] cl : Command line warning D9036 : use 'RTC1' instead of 'GZ'
[compile-cc] cl : Command line warning D9035 : option 'GZ' has been deprecated and will be
removed in a future release
[compile-cc] cl : Command line warning D9036 : use 'RTC1' instead of 'GZ'
[compile-cc] cl : Command line warning D9035 : option 'GZ' has been deprecated and will be
removed in a future release
[compile-cc] cl : Command line warning D9036 : use 'RTC1' instead of 'GZ'
[cc] cl : Command line warning D9035 : option 'GZ' has been deprecated and will be removed
in a future release
[cc] cl : Command line warning D9036 : use 'RTC1' instead of 'GZ'
[cc] cl : Command line warning D9035 : option 'GZ' has been deprecated and will be removed
in a future release
[cc] cl : Command line warning D9036 : use 'RTC1' instead of 'GZ'
[compile-cc] cl : Command line warning D9025 : overriding '/W3' with '/W4'
[compile-cc] cl : Command line warning D9035 : option 'GZ' has been deprecated and will be
removed in a future release
[compile-cc] cl : Command line warning D9036 : use 'RTC1' instead of 'GZ'
[compile-cc] cl : Command line warning D9035 : option 'GZ' has been deprecated and will be
removed in a future release
[compile-cc] cl : Command line warning D9036 : use 'RTC1' instead of 'GZ'
[compile-cc] cl : Command line warning D9035 : option 'GZ' has been deprecated and will be
removed in a future release
[compile-cc] cl : Command line warning D9036 : use 'RTC1' instead of 'GZ'
BUILD FAILED
C:\harmony.cc\infra\build\checkouts\hdk\build.xml:505: The following error occurred while
executing this line:
C:\harmony.cc\infra\build\checkouts\hdk\working_jdktools\build.xml:115: The following error
occurred while executing this line:
C:\harmony.cc\infra\build\checkouts\hdk\working_jdktools\make\build-native.xml:42: The following
error occurred while executing this line:
C:\harmony.cc\infra\build\checkouts\hdk\common_resources\make\properties.xml:243: The following
error occurred while executing this line:
C:\harmony.cc\infra\build\checkouts\hdk\working_jdktools\modules\samsa\build.xml:50: The following
error occurred while executing this line:
C:\harmony.cc\infra\build\checkouts\hdk\common_resources\make\properties.xml:266: exec returned:
2
Total time: 27 minutes 28 seconds
The execution FAILED with the following exception:
The following error occurred while executing this line:
C:\harmony.cc\infra\adaptors\hdk\adaptor.xml:39: The following error occurred while executing
this line:
C:\harmony.cc\infra\scripts\framework.xml:163: Java returned: 1

***********************************************************
Unit Tests: (0)
        
No Tests Run: This project doesn't have any tests

***********************************************************
Modifications since last successful build:	(1)
            
modified sjanuary  /harmony/enhanced/classlib/trunk/modules/beans/src/main/java/java/beans/XMLEncoder.java
10/27/2008 08:40:46 Javadoc spelling fixes


Mime
  • Unnamed multipart/mixed (inline, None, 0 bytes)
View raw message