harmony-alerts mailing list archives

Site index · List index
Message view « Date » · « Thread »
Top « Date » · « Thread »
From nom...@intel.com
Subject [build-test alert] FAILED Linux x86_64: hdk debug
Date Wed, 22 Oct 2008 18:07:33 GMT

BUILD FAILED:
	Ant Error Message:
/home/laichunrong/harmony.regularcc/infra/scripts/cc-exec-adaptor.xml:68: The following error
occurred while executing this line: /home/laichunrong/harmony.regularcc/infra/adaptors/hdk/adaptor.xml:39:
The following error occurred while executing this line: /home/laichunrong/harmony.regularcc/infra/scripts/framework.xml:163:
Java returned: 1

Date of build:	2008-10-23 02:02:21 +0800
Time to build:	4 minutes 32 seconds
Last changed:	10/22/2008 17:42:26
Last log entry:	Pack200 test update

***********************************************************
Errors/Warnings:	(8)
            
BUILD FAILED
/home/laichunrong/harmony.regularcc/infra/build/checkouts/hdk/build.xml:400: The following
error occurred while executing this line:
/home/laichunrong/harmony.regularcc/infra/build/checkouts/hdk/working_classlib/build.xml:113:
The following error occurred while executing this line:
/home/laichunrong/harmony.regularcc/infra/build/checkouts/hdk/working_classlib/make/build-java.xml:182:
The following error occurred while executing this line:
/home/laichunrong/harmony.regularcc/infra/build/checkouts/hdk/working_classlib/make/properties.xml:473:
The following error occurred while executing this line:
/home/laichunrong/harmony.regularcc/infra/build/checkouts/hdk/working_classlib/modules/pack200/build.xml:106:
Compile failed; see the compiler error output for details.
Total time: 3 minutes 35 seconds
The execution FAILED with the following exception:
The following error occurred while executing this line:
/home/laichunrong/harmony.regularcc/infra/adaptors/hdk/adaptor.xml:39: The following error
occurred while executing this line:
/home/laichunrong/harmony.regularcc/infra/scripts/framework.xml:163: Java returned: 1

***********************************************************
Unit Tests: (0)
        
No Tests Run: This project doesn't have any tests

***********************************************************
Modifications since last successful build:	(7)
            
modified sjanuary  /harmony/enhanced/classlib/trunk/modules/pack200/src/test/java/org/apache/harmony/pack200/tests/ArchiveTest.java
10/22/2008 17:42:26 Pack200 test update
modified sjanuary  /harmony/enhanced/classlib/trunk/modules/pack200/src/main/java/org/apache/harmony/pack200/FileBands.java
10/22/2008 17:39:19 Pack200 progress, including gzip support and file bands implementation
modified sjanuary  /harmony/enhanced/classlib/trunk/modules/pack200/src/main/java/org/apache/harmony/pack200/CpBands.java
10/22/2008 17:39:19 Pack200 progress, including gzip support and file bands implementation
modified sjanuary  /harmony/enhanced/classlib/trunk/modules/pack200/src/main/java/org/apache/harmony/pack200/BandSet.java
10/22/2008 17:39:19 Pack200 progress, including gzip support and file bands implementation
modified sjanuary  /harmony/enhanced/classlib/trunk/modules/pack200/src/main/java/org/apache/harmony/pack200/Archive.java
10/22/2008 17:39:19 Pack200 progress, including gzip support and file bands implementation
modified sjanuary  /harmony/enhanced/classlib/trunk/modules/pack200/src/main/java/org/apache/harmony/pack200/Segment.java
10/22/2008 17:39:19 Pack200 progress, including gzip support and file bands implementation
modified sjanuary  /harmony/enhanced/classlib/trunk/modules/pack200/src/main/java/org/apache/harmony/pack200/CPSignature.java
10/22/2008 17:39:19 Pack200 progress, including gzip support and file bands implementation


Mime
  • Unnamed multipart/mixed (inline, None, 0 bytes)
View raw message