harmony-alerts mailing list archives

Site index · List index
Message view « Date » · « Thread »
Top « Date » · « Thread »
From nom...@intel.com
Subject [build-test alert] FAILED Linux x86_64: classlib-test debug
Date Tue, 21 Oct 2008 03:33:17 GMT

BUILD FAILED:
	Ant Error Message:
/home/laichunrong/harmony.regularcc/infra/scripts/cc-exec-adaptor.xml:68: The following error
occurred while executing this line: /home/laichunrong/harmony.regularcc/infra/adaptors/classlib-test/adaptor.xml:92:
There were CLASSLIB Unit Test failures.

Date of build:	2008-10-21 11:26:41 +0800
Time to build:	6 minutes 19 seconds

***********************************************************
Errors/Warnings:	(57)
            
Checking depends/jars/yoko-1.0/yoko.jar
Fetching depends/jars/yoko-1.0/yoko.jar
Checksum verified (true)
Checking depends/jars/yoko-1.0/yoko-core.jar
Fetching depends/jars/yoko-1.0/yoko-core.jar
Checksum verified (true)
Checking depends/jars/yoko-1.0/yoko-rmi-impl.jar
Fetching depends/jars/yoko-1.0/yoko-rmi-impl.jar
Checksum verified (true)
Checking depends/jars/yoko-1.0/yoko-rmi-spec.jar
Fetching depends/jars/yoko-1.0/yoko-rmi-spec.jar
Checksum verified (true)
Checking depends/jars/bcel-5.2/bcel-5.2.jar
Fetching depends/jars/bcel-5.2/bcel-5.2.jar
Checksum verified (true)
Checking depends/jars/xalan-j_2.7.0/xalan.jar
Fetching depends/jars/xalan-j_2.7.0/xalan.jar
Checksum verified (true)
Checking depends/jars/xerces_2.9.1/xerces.zip
Fetching depends/jars/xerces_2.9.1/xerces.zip
Checksum verified (true)
Checking depends/jars/junit_4.4/junit.jar
Fetching depends/jars/junit_4.4/junit.jar
Checksum verified (true)
Checking depends/jars/bcprov-jdk15-141/bcprov.jar
Fetching depends/jars/bcprov-jdk15-141/bcprov.jar
Checksum verified (true)
Checking depends/jars/mx4j_3.0.2/mx4j.zip
Fetching depends/jars/mx4j_3.0.2/mx4j.zip
Checksum verified (true)
Checking depends/jars/jetty/jetty-6.0.0.jar
Fetching depends/jars/jetty/jetty-6.0.0.jar
Checksum verified (true)
Checking depends/jars/jetty/jetty-util-6.0.0.jar
Fetching depends/jars/jetty/jetty-util-6.0.0.jar
Checksum verified (true)
Checking depends/jars/jetty/servlet-api-2.5-6.0.0.jar
Fetching depends/jars/jetty/servlet-api-2.5-6.0.0.jar
Checksum verified (true)
Checking depends/dejavu-fonts/dejavu-ttf-2.18-1.zip
Fetching depends/dejavu-fonts/dejavu-ttf-2.18-1.zip
Checksum verified (true)
Checking depends/jars/derby-10.3.1.4/derby.jar
Fetching depends/jars/derby-10.3.1.4/derby.jar
Checksum verified (true)
Checking depends/jars/asm-3.1/asm-3.1.jar
Fetching depends/jars/asm-3.1/asm-3.1.jar
Checksum verified (true)
[exec] Execute failed: java.io.IOException: java.io.IOException: /home/laichunrong/harmony.regularcc/infra/build/checkouts/hdk/target/hdk/jdk/jre/bin/java:
not found
BUILD FAILED
/home/laichunrong/harmony.regularcc/infra/build/checkouts/hdk/working_classlib/build.xml:169:
The following error occurred while executing this line:
/home/laichunrong/harmony.regularcc/infra/build/checkouts/hdk/working_classlib/make/build-test.xml:56:
The following error occurred while executing this line:
/home/laichunrong/harmony.regularcc/infra/build/checkouts/hdk/working_classlib/make/properties.xml:473:
The following error occurred while executing this line:
/home/laichunrong/harmony.regularcc/infra/build/checkouts/hdk/working_classlib/modules/accessibility/build.xml:184:
Process fork failed.
Total time: 10 seconds
The execution FAILED with the following exception:
The following error occurred while executing this line:
/home/laichunrong/harmony.regularcc/infra/adaptors/classlib-test/adaptor.xml:92: There were
CLASSLIB Unit Test failures.

***********************************************************
Unit Tests: (0)
        
No Tests Run: This project doesn't have any tests

***********************************************************
Modifications since last successful build:	(0)
            


Mime
  • Unnamed multipart/mixed (inline, None, 0 bytes)
View raw message