harmony-alerts mailing list archives

Site index · List index
Message view « Date » · « Thread »
Top « Date » · « Thread »
From nom...@intel.com
Subject [build-test alert] FAILED Linux x86_64: ehwa-api debug
Date Tue, 21 Oct 2008 06:02:42 GMT

BUILD FAILED:
	Ant Error Message:
/home/laichunrong/harmony.regularcc/infra/scripts/cc-exec-adaptor.xml:68: The following error
occurred while executing this line: /home/laichunrong/harmony.regularcc/infra/adaptors/ehwa-api/adaptor.xml:98:
The following error occurred while executing this line: /home/laichunrong/harmony.regularcc/infra/scripts/framework.xml:163:
Java returned: 1

Date of build:	2008-10-21 13:59:15 +0800
Time to build:	3 minutes 22 seconds
Last changed:	10/21/2008 11:34:32
Last log entry:	hdk

***********************************************************
Errors/Warnings:	(9)
            
[java] Java Result: 13
[java] Java Result: 13
[java] Java Result: 13
[java] Java Result: 13
[java] Java Result: 13
BUILD FAILED
/home/laichunrong/harmony.regularcc/infra/build/checkouts/ehwa-api/tests/ehwa-test.xml:100:
Eclipse HelloWorld scenario FAILED
Total time: 3 minutes 14 seconds
The execution FAILED with the following exception:
The following error occurred while executing this line:
/home/laichunrong/harmony.regularcc/infra/adaptors/ehwa-api/adaptor.xml:98: The following
error occurred while executing this line:
/home/laichunrong/harmony.regularcc/infra/scripts/framework.xml:163: Java returned: 1

***********************************************************
Unit Tests: (0)
        
No Tests Run: This project doesn't have any tests

***********************************************************
Modifications since last successful build:	(1)
            
add cc-hdk log20081021113432Lbuild.1 10/21/2008 11:34:32hdk


Mime
  • Unnamed multipart/mixed (inline, None, 0 bytes)
View raw message