harmony-alerts mailing list archives

Site index · List index
Message view « Date » · « Thread »
Top « Date » · « Thread »
From nom...@intel.com
Subject [build-test alert] FAILED Linux x86_64: drlvm-test debug
Date Tue, 21 Oct 2008 03:34:24 GMT

BUILD FAILED:
	Ant Error Message:
/home/laichunrong/harmony.regularcc/infra/scripts/cc-exec-adaptor.xml:68: The following error
occurred while executing this line: /home/laichunrong/harmony.regularcc/infra/adaptors/drlvm-test/adaptor.xml:81:
There were drlvm-test failures

Date of build:	2008-10-21 11:33:57 +0800
Time to build:	22 seconds

***********************************************************
Errors/Warnings:	(25)
            
[cc] In file included from /home/laichunrong/harmony.regularcc/infra/build/checkouts/hdk/working_vm/vm/tests/jvmti/Breakpoint1/agent.cpp:22:
[cc] /home/laichunrong/harmony.regularcc/infra/build/checkouts/hdk/working_vm/vm/tests/jvmti/Breakpoint1/agent.h:28:19:
error: jvmti.h: No such file or directory
[cc] /home/laichunrong/harmony.regularcc/infra/build/checkouts/hdk/working_vm/vm/tests/jvmti/Breakpoint1/agent.cpp:32:
error: expected initializer before ‘agent_callback_MethodEntry’
[cc] /home/laichunrong/harmony.regularcc/infra/build/checkouts/hdk/working_vm/vm/tests/jvmti/Breakpoint1/agent.cpp:38:
error: expected initializer before ‘agent_callback_Breakpoint’
[cc] /home/laichunrong/harmony.regularcc/infra/build/checkouts/hdk/working_vm/vm/tests/jvmti/Breakpoint1/agent.cpp:44:
error: ‘jint’ does not name a type
[cc] /home/laichunrong/harmony.regularcc/infra/build/checkouts/hdk/working_vm/vm/tests/jvmti/Breakpoint1/agent.cpp:68:
error: ‘jint’ does not name a type
[cc] /home/laichunrong/harmony.regularcc/infra/build/checkouts/hdk/working_vm/vm/tests/jvmti/Breakpoint1/agent.cpp:100:
error: ‘JNIEXPORT’ does not name a type
[cc] In file included from /home/laichunrong/harmony.regularcc/infra/build/checkouts/hdk/working_vm/vm/tests/jvmti/Breakpoint1/breakpoint.cpp:22:
[cc] /home/laichunrong/harmony.regularcc/infra/build/checkouts/hdk/working_vm/vm/tests/jvmti/Breakpoint1/agent.h:28:19:
error: jvmti.h: No such file or directory
[cc] /home/laichunrong/harmony.regularcc/infra/build/checkouts/hdk/working_vm/vm/tests/jvmti/Breakpoint1/breakpoint.cpp:24:
error: ‘jint’ does not name a type
[cc] /home/laichunrong/harmony.regularcc/infra/build/checkouts/hdk/working_vm/vm/tests/jvmti/Breakpoint1/breakpoint.cpp:28:
error: variable or field ‘set_test_success’ declared void
[cc] /home/laichunrong/harmony.regularcc/infra/build/checkouts/hdk/working_vm/vm/tests/jvmti/Breakpoint1/breakpoint.cpp:28:
error: ‘jvmtiEnv’ was not declared in this scope
[cc] /home/laichunrong/harmony.regularcc/infra/build/checkouts/hdk/working_vm/vm/tests/jvmti/Breakpoint1/breakpoint.cpp:28:
error: ‘jvmti_env’ was not declared in this scope
[cc] /home/laichunrong/harmony.regularcc/infra/build/checkouts/hdk/working_vm/vm/tests/jvmti/Breakpoint1/breakpoint.cpp:29:
error: ‘JNIEnv’ was not declared in this scope
[cc] /home/laichunrong/harmony.regularcc/infra/build/checkouts/hdk/working_vm/vm/tests/jvmti/Breakpoint1/breakpoint.cpp:29:
error: ‘jni_env’ was not declared in this scope
[cc] /home/laichunrong/harmony.regularcc/infra/build/checkouts/hdk/working_vm/vm/tests/jvmti/Breakpoint1/breakpoint.cpp:30:
error: ‘jmethodID’ was not declared in this scope
[cc] /home/laichunrong/harmony.regularcc/infra/build/checkouts/hdk/working_vm/vm/tests/jvmti/Breakpoint1/breakpoint.cpp:30:
error: initializer expression list treated as compound expression
[cc] /home/laichunrong/harmony.regularcc/infra/build/checkouts/hdk/working_vm/vm/tests/jvmti/Breakpoint1/breakpoint.cpp:31:
error: expected ‘,’ or ‘;’ before ‘{’ token
BUILD FAILED
/home/laichunrong/harmony.regularcc/infra/build/checkouts/hdk/working_vm/build.xml:346: The
following error occurred while executing this line:
/home/laichunrong/harmony.regularcc/infra/build/checkouts/hdk/working_vm/make/tests/jvmti-test.xml:50:
The following error occurred while executing this line:
/home/laichunrong/harmony.regularcc/infra/build/checkouts/hdk/working_vm/make/tests/jvmti-test.xml:60:
gcc failed with return code 1
Total time: 6 seconds
The execution FAILED with the following exception:
The following error occurred while executing this line:
/home/laichunrong/harmony.regularcc/infra/adaptors/drlvm-test/adaptor.xml:81: There were drlvm-test
failures

***********************************************************
Unit Tests: (0)
        
No Tests Run: This project doesn't have any tests

***********************************************************
Modifications since last successful build:	(0)
            


Mime
  • Unnamed multipart/mixed (inline, None, 0 bytes)
View raw message