harmony-alerts mailing list archives

Site index · List index
Message view « Date » · « Thread »
Top « Date » · « Thread »
From nom...@intel.com
Subject [build-test alert] FAILED Linux x86: drlvm-test debug
Date Fri, 24 Oct 2008 08:19:12 GMT

BUILD FAILED:
	Ant Error Message:
/home/laichunrong/harmony.regularcc/infra/scripts/cc-exec-adaptor.xml:68: The following error
occurred while executing this line: /home/laichunrong/harmony.regularcc/infra/adaptors/drlvm-test/adaptor.xml:81:
There were drlvm-test failures

Date of build:	2008-10-24 11:56:26 +0800
Time to build:	262 minutes 41 seconds
Last changed:	10/24/2008 09:59:52
Last log entry:	hdk

***********************************************************
Errors/Warnings:	(21)
            
[java] Java Result: 1
[java] Java Result: 1
[java] Java Result: 130
[java] Java Result: 1
[java] Java Result: 1
[java] Java Result: 130
[java] Java Result: 1
[java] Java Result: 1
[java] Java Result: 130
[java] Java Result: 1
[java] Java Result: 1
[java] Java Result: 130
[java] Java Result: 139
[java] Java Result: 1
[java] Java Result: 1
[java] Java Result: 130
BUILD FAILED
/home/laichunrong/harmony.regularcc/infra/build/checkouts/hdk/working_vm/build.xml:286: Some
tests failed
Total time: 262 minutes 28 seconds
The execution FAILED with the following exception:
The following error occurred while executing this line:
/home/laichunrong/harmony.regularcc/infra/adaptors/drlvm-test/adaptor.xml:81: There were drlvm-test
failures

***********************************************************
Unit Tests: (4185)
        
failure: Server mode JIT exception.FinalizeStackTest_srv
Unit Test Error Details:	(1)
                
Test: Server mode JITClass: exception.FinalizeStackTest_srvExit code: 139 Err:

***********************************************************
Modifications since last successful build:	(1)
            
add cc-hdk log20081024095952Lbuild.197 10/24/2008 09:59:52hdk


Mime
  • Unnamed multipart/mixed (inline, None, 0 bytes)
View raw message