harmony-alerts mailing list archives

Site index · List index
Message view « Date » · « Thread »
Top « Date » · « Thread »
From nom...@intel.com
Subject [build-test alert] FAILED Linux x86: drlvm-test debug
Date Fri, 17 Oct 2008 15:34:00 GMT

BUILD FAILED:
	Ant Error Message:
/home/laichunrong/harmony.regularcc/infra/scripts/cc-exec-adaptor.xml:68: The following error
occurred while executing this line: /home/laichunrong/harmony.regularcc/infra/adaptors/drlvm-test/adaptor.xml:81:
There were drlvm-test failures

Date of build:	2008-10-17 19:01:00 +0800
Time to build:	272 minutes 54 seconds
Last changed:	10/17/2008 17:59:10
Last log entry:	hdk

***********************************************************
Errors/Warnings:	(21)
            
[java] Java Result: 139
[java] Java Result: 1
[java] Java Result: 1
[java] Java Result: 130
[java] Java Result: 1
[java] Java Result: 1
[java] Java Result: 130
[java] Java Result: 1
[java] Java Result: 1
[java] Java Result: 130
[java] Java Result: 1
[java] Java Result: 1
[java] Java Result: 130
[java] Java Result: 1
[java] Java Result: 1
[java] Java Result: 130
BUILD FAILED
/home/laichunrong/harmony.regularcc/infra/build/checkouts/hdk/working_vm/build.xml:286: Some
tests failed
Total time: 272 minutes 40 seconds
The execution FAILED with the following exception:
The following error occurred while executing this line:
/home/laichunrong/harmony.regularcc/infra/adaptors/drlvm-test/adaptor.xml:81: There were drlvm-test
failures

***********************************************************
Unit Tests: (4185)
        
failure: Client mode JIT (default) gc.NPE_jit
Unit Test Error Details:	(1)
                
Test: Client mode JIT (default)Class: gc.NPE_jitExit code: 139 Err:

***********************************************************
Modifications since last successful build:	(1)
            
add cc-hdk log20081017175910Lbuild.193 10/17/2008 17:59:10hdk


Mime
  • Unnamed multipart/mixed (inline, None, 0 bytes)
View raw message