harmony-alerts mailing list archives

Site index · List index
Message view « Date » · « Thread »
Top « Date » · « Thread »
From nom...@intel.com
Subject [build-test alert] FAILED Linux x86_64: drlvm-reg-test debug
Date Mon, 01 Sep 2008 09:39:29 GMT

BUILD FAILED:
	Ant Error Message:
/home/laichunrong/harmony.regularcc/infra/scripts/cc-exec-adaptor.xml:68: The following error
occurred while executing this line: /home/laichunrong/harmony.regularcc/infra/adaptors/drlvm-reg-test/adaptor.xml:80:
There were drlvm-reg-test failures

Date of build:	2008-09-01 17:09:11 +0800
Time to build:	30 minutes 13 seconds
Last changed:	09/01/2008 13:41:11
Last log entry:	hdk

***********************************************************
Errors/Warnings:	(10)
            
[junit] Test org.apache.harmony.drlvm.tests.regression.h3446.SubSubTest FAILED
[java] Java Result: 1
[java] Java Result: 1
[java] Java Result: 1
BUILD FAILED
/home/laichunrong/harmony.regularcc/infra/build/checkouts/hdk/working_vm/build.xml:352: The
following error occurred while executing this line:
/home/laichunrong/harmony.regularcc/infra/build/checkouts/hdk/working_vm/make/tests/reg-test-run.xml:108:
There were test failures
Total time: 29 minutes 56 seconds
The execution FAILED with the following exception:
The following error occurred while executing this line:
/home/laichunrong/harmony.regularcc/infra/adaptors/drlvm-reg-test/adaptor.xml:80: There were
drlvm-reg-test failures

***********************************************************
Unit Tests: (185)
        
All Tests Passed

***********************************************************
Modifications since last successful build:	(1)
            
add cc-hdk log20080901134111Lbuild.120 09/01/2008 13:41:11hdk


Mime
  • Unnamed multipart/mixed (inline, None, 0 bytes)
View raw message