harmony-alerts mailing list archives

Site index · List index
Message view « Date » · « Thread »
Top « Date » · « Thread »
From nom...@intel.com
Subject [build-test alert] FAILED Linux x86: ehwa-api debug
Date Thu, 04 Sep 2008 18:55:27 GMT

BUILD FAILED:
	Ant Error Message:
/home/laichunrong/harmony.regularcc/infra/scripts/cc-exec-adaptor.xml:68: The following error
occurred while executing this line: /home/laichunrong/harmony.regularcc/infra/adaptors/ehwa-api/adaptor.xml:98:
The following error occurred while executing this line: /home/laichunrong/harmony.regularcc/infra/scripts/framework.xml:163:
Java returned: 1

Date of build:	2008-09-05 02:39:32 +0800
Time to build:	15 minutes 53 seconds
Last changed:	09/05/2008 01:17:28
Last log entry:	hdk

***********************************************************
Errors/Warnings:	(5)
            
[java] Java Result: 1
BUILD FAILED
/home/laichunrong/harmony.regularcc/infra/build/checkouts/ehwa-api/tests/ehwa-test.xml:100:
Eclipse HelloWorld scenario FAILED
Total time: 15 minutes 49 seconds
The execution FAILED with the following exception:
The following error occurred while executing this line:
/home/laichunrong/harmony.regularcc/infra/adaptors/ehwa-api/adaptor.xml:98: The following
error occurred while executing this line:
/home/laichunrong/harmony.regularcc/infra/scripts/framework.xml:163: Java returned: 1

***********************************************************
Unit Tests: (0)
        
No Tests Run: This project doesn't have any tests

***********************************************************
Modifications since last successful build:	(1)
            
add cc-hdk log20080905011728Lbuild.150 09/05/2008 01:17:28hdk


Mime
  • Unnamed multipart/mixed (inline, None, 0 bytes)
View raw message