harmony-alerts mailing list archives

Site index · List index
Message view « Date » · « Thread »
Top « Date » · « Thread »
From nom...@intel.com
Subject [build-test alert] FAILED Linux x86_64: drlvm-test debug
Date Wed, 17 Sep 2008 11:30:51 GMT

BUILD FAILED:
	Ant Error Message:
/home/laichunrong/harmony.regularcc/infra/scripts/cc-exec-adaptor.xml:68: The following error
occurred while executing this line: /home/laichunrong/harmony.regularcc/infra/adaptors/drlvm-test/adaptor.xml:81:
There were drlvm-test failures

Date of build:	2008-09-17 17:34:53 +0800
Time to build:	115 minutes 47 seconds
Last changed:	09/17/2008 16:45:22
Last log entry:	hdk

***********************************************************
Errors/Warnings:	(21)
            
[java] Java Result: 1
[java] Java Result: 1
[java] Java Result: 130
[java] Java Result: 1
[java] Java Result: 1
[java] Java Result: 130
[java] Java Result: 1
[java] Java Result: 1
[java] Java Result: 130
[java] Java Result: 1
[java] Java Result: 1
[java] Java Result: 130
[java] Java Result: 1
[java] Java Result: 139
[java] Java Result: 1
[java] Java Result: 130
BUILD FAILED
/home/laichunrong/harmony.regularcc/infra/build/checkouts/hdk/working_vm/build.xml:286: Some
tests failed
Total time: 115 minutes 30 seconds
The execution FAILED with the following exception:
The following error occurred while executing this line:
/home/laichunrong/harmony.regularcc/infra/adaptors/drlvm-test/adaptor.xml:81: There were drlvm-test
failures

***********************************************************
Unit Tests: (4187)
        
failure: Server mode JIT perf.StressCornerSize_srv
Unit Test Error Details:	(1)
                
Test: Server mode JITClass: perf.StressCornerSize_srvExit code: 139 Err: 
Signal reported: GENERAL_PROTECTION_FAULT
Registers:
    RAX: 0x00000000ffffffff, RBX: 0x00000000000000b1
    RCX: 0x00000000ffffffff, RDX: 0x0000000000000000
    RSI: 0x00002aaaaaf9349c, RDI: 0x00002aaaaaab09c8
    RSP: 0x0000000040802cd0, RBP: 0x00002aaaaaab09c5
    R8 : 0x0000000040802e90, R9 : 0x00002aaaaaaab2b8
    R10: 0x0000000000000000, R11: 0x0000000009691a75
    R12: 0x0000000000000014, R13: 0x00000000bac212a0
    R14: 0x0000000000000000, R15: 0x0000000000000000
    RIP: 0x000000367f40d86d

Command line:
/home/laichunrong/harmony.regularcc/infra/build/checkouts/hdk/target/hdk/jdk/jre/bin/java
-server -XX:-vm.assert_dialog -Djava.library.path=/home/laichunrong/harmony.regularcc/infra/build/checkouts/hdk/working_vm/build/linux_x86_64_gcc_debug/tests/smoke.tests/natives/perf
-classpath /home/laichunrong/harmony.regularcc/infra/build/checkouts/hdk/working_vm/build/linux_x86_64_gcc_debug/tests/smoke.tests/classes
perf.StressCornerSize 

Working directory:
/home/laichunrong/harmony.regularcc/infra/build/checkouts/hdk/working_vm/build/linux_x86_64_gcc_debug/tests/smoke.tests

Environment variables:
JAVA_HOME=/home/laichunrong/harmony.regularcc/infra/build/checkouts/hdk/target/hdk/jdk/jre
LD_LIBRARY_PATH=/home/laichunrong/harmony.regularcc/infra/build/checkouts/hdk/target/hdk/jdk/jre/bin/default:/home/laichunrong/harmony.regularcc/infra/build/checkouts/hdk/target/hdk/jdk/jre/bin/:/home/laichunrong/harmony.regularcc/infra/build/checkouts/hdk/target/hdk/jdk/jre/bin:/jdk1.5.0_10/jre/lib/amd64/server:/jdk1.5.0_10/jre/lib/amd64:/jdk1.5.0_10/jre/../lib/amd64

Loaded modules:

/home/laichunrong/harmony.regularcc/infra/build/checkouts/hdk/target/hdk/jdk/jre/bin/java:
	0x0000000000400000:0x0000000000406000
	0x0000000000606000:0x0000000000607000
[heap]:
	0x0000000000607000:0x00000000006ae000
/lib64/ld-2.5.so:
	0x000000367f400000:0x000000367f41a000
	0x000000367f619000:0x000000367f61a000
	0x000000367f61a000:0x000000367f61b000
/lib64/libc-2.5.so:
	0x0000003680400000:0x0000003680544000
	0x0000003680544000:0x0000003680744000
	0x0000003680744000:0x0000003680748000
	0x0000003680748000:0x0000003680749000
/lib64/libm-2.5.so:
	0x0000003680800000:0x0000003680882000
	0x0000003680882000:0x0000003680a81000
	0x0000003680a81000:0x0000003680a82000
	0x0000003680a82000:0x0000003680a83000
/lib64/libdl-2.5.so:
	0x0000003680c00000:0x0000003680c03000
	0x0000003680c03000:0x0000003680e02000
	0x0000003680e02000:0x0000003680e03000
	0x0000003680e03000:0x0000003680e04000
/lib64/libpthread-2.5.so:
	0x0000003681000000:0x0000003681015000
	0x0000003681015000:0x0000003681214000
	0x0000003681214000:0x0000003681215000
	0x0000003681215000:0x0000003681216000
/usr/lib64/libz.so.1.2.3:
	0x0000003681400000:0x0000003681414000
	0x0000003681414000:0x0000003681613000
	0x0000003681613000:0x0000003681614000
/lib64/librt-2.5.so:
	0x0000003681800000:0x0000003681808000
	0x0000003681808000:0x0000003681a07000
	0x0000003681a07000:0x0000003681a08000
	0x0000003681a08000:0x0000003681a09000
/usr/lib64/libxml2.so.2.6.26:
	0x0000003689a00000:0x0000003689b33000
	0x0000003689b33000:0x0000003689d33000
	0x0000003689d33000:0x0000003689d3c000
/lib64/libgcc_s-4.1.1-20061011.so.1:
	0x000000368f200000:0x000000368f20d000
	0x000000368f20d000:0x000000368f40c000
	0x000000368f40c000:0x000000368f40d000
/usr/lib64/libstdc++.so.6.0.8:
	0x0000003691200000:0x00000036912e7000
	0x00000036912e7000:0x00000036914e7000
	0x00000036914e7000:0x00000036914ed000
	0x00000036914ed000:0x00000036914f0000
/home/laichunrong/harmony.regularcc/infra/build/checkouts/hdk/target/hdk/jdk/jre/bin/libhythr.so:
	0x00002aaaaaaad000:0x00002aaaaaad2000
	0x00002aaaaaad2000:0x00002aaaaacd2000
	0x00002aaaaacd2000:0x00002aaaaacd3000
/home/laichunrong/harmony.regularcc/infra/build/checkouts/hdk/target/hdk/jdk/jre/bin/libhyprt.so:
	0x00002aaaaad24000:0x00002aaaaad4c000
	0x00002aaaaad4c000:0x00002aaaaaf4c000
	0x00002aaaaaf4c000:0x00002aaaaaf53000
/home/laichunrong/harmony.regularcc/infra/build/checkouts/hdk/target/hdk/jdk/jre/bin/default/libch.so:
	0x00002aaaaaf92000:0x00002aaaaafa6000
	0x00002aaaaafa6000:0x00002aaaab1a6000
	0x00002aaaab1a6000:0x00002aaaab212000
/home/laichunrong/harmony.regularcc/infra/build/checkouts/hdk/target/hdk/jdk/jre/bin/default/libharmonyvm.so:
	0x00002aaaab448000:0x00002aaaab65e000
	0x00002aaaab65e000:0x00002aaaab85e000
	0x00002aaaab85e000:0x00002aaaab8d7000
/home/laichunrong/harmony.regularcc/infra/build/checkouts/hdk/target/hdk/jdk/jre/bin/default/libicuuc.so.34:
	0x00002aaaabb0e000:0x00002aaaabc22000
	0x00002aaaabc22000:0x00002aaaabe21000
	0x00002aaaabe21000:0x00002aaaabe2e000
/home/laichunrong/harmony.regularcc/infra/build/checkouts/hdk/target/hdk/jdk/jre/bin/default/libicudata.so.34:
	0x00002aaaabe49000:0x00002aaaac6bd000
	0x00002aaaac6bd000:0x00002aaaac8bc000
	0x00002aaaac8bc000:0x00002aaaac8bd000
/lib64/libnss_files-2.5.so:
	0x00002aaaacb1b000:0x00002aaaacb25000
	0x00002aaaacb25000:0x00002aaaacd24000
	0x00002aaaacd24000:0x00002aaaacd25000
	0x00002aaaacd25000:0x00002aaaacd26000
/home/laichunrong/harmony.regularcc/infra/build/checkouts/hdk/target/hdk/jdk/jre/bin/default/libem.so:
	0x00002aaaecd66000:0x00002aaaecdac000
	0x00002aaaecdac000:0x00002aaaecfac000
	0x00002aaaecfac000:0x00002aaaecfae000
/home/laichunrong/harmony.regularcc/infra/build/checkouts/hdk/target/hdk/jdk/jre/bin/default/libjitrino.so:
	0x00002aaaecfae000:0x00002aaaed408000
	0x00002aaaed408000:0x00002aaaed608000
	0x00002aaaed608000:0x00002aaaed620000
/home/laichunrong/harmony.regularcc/infra/build/checkouts/hdk/target/hdk/jdk/jre/bin/default/libgc_gen.so:
	0x00002aaaed68d000:0x00002aaaed743000
	0x00002aaaed743000:0x00002aaaed942000
	0x00002aaaed942000:0x00002aaaed945000
/home/laichunrong/harmony.regularcc/infra/build/checkouts/hdk/target/hdk/jdk/jre/bin/libhyzlib.so:
	0x00002aab0dc51000:0x00002aab0dc63000
	0x00002aab0dc63000:0x00002aab0de63000
	0x00002aab0de63000:0x00002aab0de64000
/home/laichunrong/harmony.regularcc/infra/build/checkouts/hdk/target/hdk/jdk/jre/bin/libhynio.so:
	0x00002aab0de64000:0x00002aab0de66000
	0x00002aab0de66000:0x00002aab0e065000
	0x00002aab0e065000:0x00002aab0e066000
/home/laichunrong/harmony.regularcc/infra/build/checkouts/hdk/target/hdk/jdk/jre/bin/default/libvmi.so:
	0x00002aab0e066000:0x00002aab0e06c000
	0x00002aab0e06c000:0x00002aab0e26c000
	0x00002aab0e26c000:0x00002aab0e26d000
/home/laichunrong/harmony.regularcc/infra/build/checkouts/hdk/target/hdk/jdk/jre/bin/libhyluni.so:
	0x00002aab0e26e000:0x00002aab0e2a7000
	0x00002aab0e2a7000:0x00002aab0e4a6000
	0x00002aab0e4a6000:0x00002aab0e4a7000
/home/laichunrong/harmony.regularcc/infra/build/checkouts/hdk/target/hdk/jdk/jre/bin/libhyarchive.so:
	0x00002aab0e4a7000:0x00002aab0e4b4000
	0x00002aab0e4b4000:0x00002aab0e6b4000
	0x00002aab0e6b4000:0x00002aab0e6b5000
[stack]:
	0x00007fff557f4000:0x00007fff561e2000
[vdso]:
	0xffffffffff600000:0xffffffffffe00000

Stack trace:
  0: 0x000000367f40d86d  ?? (??:-1)
  1: 0x000000367f408eaf  ?? (??:-1)
  2: 0x000000367f409262  ?? (??:-1)
  3: 0x000000367f40cbd3  ?? (??:-1)
  4: 0x000000367f412382  ?? (??:-1)
  5: 0x000000367f412382  ?? (??:-1)
  6: 0x00002aaaaaabba54  thread_start_func (thread_os.c:106)
  7: 0x0000003681006305  ?? (??:-1)
  8: 0x00000036804cd62d  ?? (??:-1)
<end of stack trace>

Crashed module:
/lib64/ld-2.5.so
(Unknown/system native module)

Current thread is not attached to VM, ID: 23467

VM attached threads:

    [0x2aaaaaf70500]

***********************************************************
Modifications since last successful build:	(1)
            
add cc-hdk log20080917164522Lbuild.156 09/17/2008 16:45:22hdk


Mime
  • Unnamed multipart/mixed (inline, None, 0 bytes)
View raw message