harmony-alerts mailing list archives

Site index · List index
Message view « Date » · « Thread »
Top « Date » · « Thread »
From nom...@intel.com
Subject [build-test alert] FAILED Linux x86_64: drlvm-test debug
Date Wed, 03 Sep 2008 06:21:39 GMT

BUILD FAILED:
	Ant Error Message:
/home/laichunrong/harmony.regularcc/infra/scripts/cc-exec-adaptor.xml:68: The following error
occurred while executing this line: /home/laichunrong/harmony.regularcc/infra/adaptors/drlvm-test/adaptor.xml:81:
There were drlvm-test failures

Date of build:	2008-09-03 12:22:42 +0800
Time to build:	118 minutes 45 seconds
Last changed:	09/03/2008 11:22:53
Last log entry:	hdk

***********************************************************
Errors/Warnings:	(21)
            
[java] Java Result: 1
[java] Java Result: 1
[java] Java Result: 130
[java] Java Result: 1
[java] Java Result: 1
[java] Java Result: 130
[java] Java Result: 1
[java] Java Result: 1
[java] Java Result: 130
[java] Java Result: 134
[java] Java Result: 1
[java] Java Result: 1
[java] Java Result: 130
[java] Java Result: 1
[java] Java Result: 1
[java] Java Result: 130
BUILD FAILED
/home/laichunrong/harmony.regularcc/infra/build/checkouts/hdk/working_vm/build.xml:286: Some
tests failed
Total time: 118 minutes 23 seconds
The execution FAILED with the following exception:
The following error occurred while executing this line:
/home/laichunrong/harmony.regularcc/infra/adaptors/drlvm-test/adaptor.xml:81: There were drlvm-test
failures

***********************************************************
Unit Tests: (4187)
        
failure: jitrino.OPT thread.SmallStackThreadTest_opt
Unit Test Error Details:	(1)
                
Test: jitrino.OPTClass: thread.SmallStackThreadTest_optExit code: 134 Err: java: /home/laichunrong/harmony.regularcc/infra/build/checkouts/hdk/working_vm/vm/vmcore/src/class_support/C_Interface.cpp:1249:
method_get_signature: Assertion `mh' failed.

Signal reported: ABORT

Registers info is absent

Command line:
/home/laichunrong/harmony.regularcc/infra/build/checkouts/hdk/target/hdk/jdk/jre/bin/java
-Xem:opt -XX:-vm.assert_dialog -Djava.library.path=/home/laichunrong/harmony.regularcc/infra/build/checkouts/hdk/working_vm/build/linux_x86_64_gcc_debug/tests/smoke.tests/natives/thread
-classpath /home/laichunrong/harmony.regularcc/infra/build/checkouts/hdk/working_vm/build/linux_x86_64_gcc_debug/tests/smoke.tests/classes
thread.SmallStackThreadTest 

Working directory:
/home/laichunrong/harmony.regularcc/infra/build/checkouts/hdk/working_vm/build/linux_x86_64_gcc_debug/tests/smoke.tests

Environment variables:
JAVA_HOME=/home/laichunrong/harmony.regularcc/infra/build/checkouts/hdk/target/hdk/jdk/jre
LD_LIBRARY_PATH=/home/laichunrong/harmony.regularcc/infra/build/checkouts/hdk/target/hdk/jdk/jre/bin/default:/home/laichunrong/harmony.regularcc/infra/build/checkouts/hdk/target/hdk/jdk/jre/bin/:/home/laichunrong/harmony.regularcc/infra/build/checkouts/hdk/target/hdk/jdk/jre/bin:/jdk1.5.0_10/jre/lib/amd64/server:/jdk1.5.0_10/jre/lib/amd64:/jdk1.5.0_10/jre/../lib/amd64

Loaded modules:

/home/laichunrong/harmony.regularcc/infra/build/checkouts/hdk/target/hdk/jdk/jre/bin/java:
	0x0000000000400000:0x0000000000406000
	0x0000000000606000:0x0000000000607000
[heap]:
	0x0000000000607000:0x00000000032fd000
/lib64/ld-2.5.so:
	0x000000367f400000:0x000000367f41a000
	0x000000367f619000:0x000000367f61a000
	0x000000367f61a000:0x000000367f61b000
/lib64/libc-2.5.so:
	0x0000003680400000:0x0000003680544000
	0x0000003680544000:0x0000003680744000
	0x0000003680744000:0x0000003680748000
	0x0000003680748000:0x0000003680749000
/lib64/libm-2.5.so:
	0x0000003680800000:0x0000003680882000
	0x0000003680882000:0x0000003680a81000
	0x0000003680a81000:0x0000003680a82000
	0x0000003680a82000:0x0000003680a83000
/lib64/libdl-2.5.so:
	0x0000003680c00000:0x0000003680c03000
	0x0000003680c03000:0x0000003680e02000
	0x0000003680e02000:0x0000003680e03000
	0x0000003680e03000:0x0000003680e04000
/lib64/libpthread-2.5.so:
	0x0000003681000000:0x0000003681015000
	0x0000003681015000:0x0000003681214000
	0x0000003681214000:0x0000003681215000
	0x0000003681215000:0x0000003681216000
/usr/lib64/libz.so.1.2.3:
	0x0000003681400000:0x0000003681414000
	0x0000003681414000:0x0000003681613000
	0x0000003681613000:0x0000003681614000
/lib64/librt-2.5.so:
	0x0000003681800000:0x0000003681808000
	0x0000003681808000:0x0000003681a07000
	0x0000003681a07000:0x0000003681a08000
	0x0000003681a08000:0x0000003681a09000
/usr/lib64/libxml2.so.2.6.26:
	0x0000003689a00000:0x0000003689b33000
	0x0000003689b33000:0x0000003689d33000
	0x0000003689d33000:0x0000003689d3c000
/lib64/libgcc_s-4.1.1-20061011.so.1:
	0x000000368f200000:0x000000368f20d000
	0x000000368f20d000:0x000000368f40c000
	0x000000368f40c000:0x000000368f40d000
/usr/lib64/libstdc++.so.6.0.8:
	0x0000003691200000:0x00000036912e7000
	0x00000036912e7000:0x00000036914e7000
	0x00000036914e7000:0x00000036914ed000
	0x00000036914ed000:0x00000036914f0000
/home/laichunrong/harmony.regularcc/infra/build/checkouts/hdk/target/hdk/jdk/jre/bin/libhythr.so:
	0x00002aaaaaaad000:0x00002aaaaaad2000
	0x00002aaaaaad2000:0x00002aaaaacd2000
	0x00002aaaaacd2000:0x00002aaaaacd3000
/home/laichunrong/harmony.regularcc/infra/build/checkouts/hdk/target/hdk/jdk/jre/bin/libhyprt.so:
	0x00002aaaaad24000:0x00002aaaaad4c000
	0x00002aaaaad4c000:0x00002aaaaaf4c000
	0x00002aaaaaf4c000:0x00002aaaaaf53000
/home/laichunrong/harmony.regularcc/infra/build/checkouts/hdk/target/hdk/jdk/jre/bin/default/libch.so:
	0x00002aaaaaf92000:0x00002aaaaafa6000
	0x00002aaaaafa6000:0x00002aaaab1a6000
	0x00002aaaab1a6000:0x00002aaaab212000
/home/laichunrong/harmony.regularcc/infra/build/checkouts/hdk/target/hdk/jdk/jre/bin/default/libharmonyvm.so:
	0x00002aaaab448000:0x00002aaaab65d000
	0x00002aaaab65d000:0x00002aaaab85d000
	0x00002aaaab85d000:0x00002aaaab8d6000
/home/laichunrong/harmony.regularcc/infra/build/checkouts/hdk/target/hdk/jdk/jre/bin/default/libicuuc.so.34:
	0x00002aaaabb0d000:0x00002aaaabc21000
	0x00002aaaabc21000:0x00002aaaabe20000
	0x00002aaaabe20000:0x00002aaaabe2d000
/home/laichunrong/harmony.regularcc/infra/build/checkouts/hdk/target/hdk/jdk/jre/bin/default/libicudata.so.34:
	0x00002aaaabe48000:0x00002aaaac6bc000
	0x00002aaaac6bc000:0x00002aaaac8bb000
	0x00002aaaac8bb000:0x00002aaaac8bc000
/lib64/libnss_files-2.5.so:
	0x00002aaaacb1a000:0x00002aaaacb24000
	0x00002aaaacb24000:0x00002aaaacd23000
	0x00002aaaacd23000:0x00002aaaacd24000
	0x00002aaaacd24000:0x00002aaaacd25000
/home/laichunrong/harmony.regularcc/infra/build/checkouts/hdk/target/hdk/jdk/jre/bin/default/libem.so:
	0x00002aaaecd65000:0x00002aaaecdab000
	0x00002aaaecdab000:0x00002aaaecfab000
	0x00002aaaecfab000:0x00002aaaecfad000
/home/laichunrong/harmony.regularcc/infra/build/checkouts/hdk/target/hdk/jdk/jre/bin/default/libjitrino.so:
	0x00002aaaecfad000:0x00002aaaed407000
	0x00002aaaed407000:0x00002aaaed607000
	0x00002aaaed607000:0x00002aaaed61f000
/home/laichunrong/harmony.regularcc/infra/build/checkouts/hdk/target/hdk/jdk/jre/bin/default/libgc_gen.so:
	0x00002aaaed68c000:0x00002aaaed742000
	0x00002aaaed742000:0x00002aaaed941000
	0x00002aaaed941000:0x00002aaaed944000
/home/laichunrong/harmony.regularcc/infra/build/checkouts/hdk/target/hdk/jdk/jre/bin/libhyzlib.so:
	0x00002aab0dc50000:0x00002aab0dc62000
	0x00002aab0dc62000:0x00002aab0de62000
	0x00002aab0de62000:0x00002aab0de63000
/home/laichunrong/harmony.regularcc/infra/build/checkouts/hdk/target/hdk/jdk/jre/bin/libhynio.so:
	0x00002aab0de63000:0x00002aab0de65000
	0x00002aab0de65000:0x00002aab0e064000
	0x00002aab0e064000:0x00002aab0e065000
/home/laichunrong/harmony.regularcc/infra/build/checkouts/hdk/target/hdk/jdk/jre/bin/default/libvmi.so:
	0x00002aab0e065000:0x00002aab0e06b000
	0x00002aab0e06b000:0x00002aab0e26b000
	0x00002aab0e26b000:0x00002aab0e26c000
/home/laichunrong/harmony.regularcc/infra/build/checkouts/hdk/target/hdk/jdk/jre/bin/libhyluni.so:
	0x00002aab0e26c000:0x00002aab0e2a5000
	0x00002aab0e2a5000:0x00002aab0e4a4000
	0x00002aab0e4a4000:0x00002aab0e4a5000
/home/laichunrong/harmony.regularcc/infra/build/checkouts/hdk/target/hdk/jdk/jre/bin/libhyarchive.so:
	0x00002aab0e4a5000:0x00002aab0e4b2000
	0x00002aab0e4b2000:0x00002aab0e6b2000
	0x00002aab0e6b2000:0x00002aab0e6b3000
/home/laichunrong/harmony.regularcc/infra/build/checkouts/hdk/target/hdk/jdk/jre/bin/libhycharset.so:
	0x00002aab0e6b3000:0x00002aab0e806000
	0x00002aab0e806000:0x00002aab0ea06000
	0x00002aab0ea06000:0x00002aab0ea2e000
[stack]:
	0x00007fff29030000:0x00007fff29a1e000
[vdso]:
	0xffffffffff600000:0xffffffffffe00000

No stack trace due to registers info absence

***********************************************************
Modifications since last successful build:	(1)
            
add cc-hdk log20080903112253Lbuild.127 09/03/2008 11:22:53hdk


Mime
  • Unnamed multipart/mixed (inline, None, 0 bytes)
View raw message