harmony-alerts mailing list archives

Site index · List index
Message view « Date » · « Thread »
Top « Date » · « Thread »
From nom...@intel.com
Subject [build-test alert] FAILED Linux x86: drlvm-test debug
Date Fri, 12 Sep 2008 13:18:45 GMT

BUILD FAILED:
	Ant Error Message:
/home/laichunrong/harmony.regularcc/infra/scripts/cc-exec-adaptor.xml:68: The following error
occurred while executing this line: /home/laichunrong/harmony.regularcc/infra/adaptors/drlvm-test/adaptor.xml:81:
There were drlvm-test failures

Date of build:	2008-09-12 16:38:13 +0800
Time to build:	280 minutes 26 seconds
Last changed:	09/12/2008 16:02:16
Last log entry:	hdk

***********************************************************
Errors/Warnings:	(20)
            
[java] Java Result: 1
[java] Java Result: 1
[java] Java Result: 130
[java] Java Result: 1
[java] Java Result: 1
[java] Java Result: 130
[java] Java Result: 1
[java] Java Result: 1
[java] Java Result: 130
[java] Java Result: 1
[java] Java Result: 1
[java] Java Result: 130
[java] Java Result: 1
[java] Java Result: 1
[java] Java Result: 130
BUILD FAILED
/home/laichunrong/harmony.regularcc/infra/build/checkouts/hdk/working_vm/build.xml:286: Some
tests failed
Total time: 280 minutes 9 seconds
The execution FAILED with the following exception:
The following error occurred while executing this line:
/home/laichunrong/harmony.regularcc/infra/adaptors/drlvm-test/adaptor.xml:81: There were drlvm-test
failures

***********************************************************
Unit Tests: (4185)
        
failure: interpreter gc.RunFinalizersOnExitTest_int
Unit Test Error Details:	(1)
                
Test: interpreterClass: gc.RunFinalizersOnExitTest_intExit code: 0 Err: 
(0%, 0%, 0%)
(0%, 0%, 0%)
(0%, 0%, 1%)
(0%, 0%, 2%)
(0%, 0%, 3%)
(0%, 0%, 3%)
(0%, 0%, 4%)
(0%, 0%, 5%)
(0%, 0%, 6%)
(0%, 0%, 7%)
(0%, 0%, 7%)
(0%, 0%, 8%)
(0%, 0%, 9%)
(0%, 0%, 10%)
(0%, 0%, 10%)
(0%, 0%, 11%)
(0%, 0%, 12%)
(0%, 0%, 13%)
(0%, 0%, 14%)
(0%, 0%, 14%)
(0%, 0%, 15%)
(0%, 0%, 16%)
(0%, 0%, 17%)
(0%, 0%, 17%)
(0%, 0%, 18%)
(0%, 0%, 19%)
(0%, 0%, 20%)
(0%, 0%, 21%)
(0%, 0%, 21%)
(0%, 0%, 22%)
(0%, 0%, 23%)
(0%, 0%, 24%)
(0%, 0%, 25%)
(0%, 0%, 25%)
(0%, 0%, 26%)
(0%, 0%, 27%)
(0%, 0%, 28%)
(0%, 0%, 28%)
(0%, 0%, 29%)
(0%, 0%, 30%)
(0%, 0%, 31%)
(0%, 0%, 32%)
(0%, 0%, 32%)
(0%, 0%, 33%)
(0%, 0%, 34%)
(0%, 0%, 35%)
(0%, 0%, 35%)
(0%, 0%, 36%)
(0%, 0%, 37%)
(0%, 0%, 38%)
(0%, 0%, 39%)
(0%, 0%, 39%)
(0%, 0%, 40%)
(0%, 0%, 41%)
(0%, 0%, 42%)
(0%, 0%, 42%)
(0%, 0%, 43%)
(0%, 0%, 44%)
(0%, 0%, 45%)
(0%, 0%, 46%)
(0%, 0%, 46%)
(0%, 0%, 47%)
(0%, 0%, 48%)
(0%, 0%, 49%)
(0%, 0%, 50%)
(0%, 0%, 50%)
(0%, 0%, 51%)
(0%, 0%, 52%)
(0%, 0%, 53%)
(0%, 0%, 53%)
(0%, 0%, 54%)
(0%, 0%, 55%)
(0%, 0%, 56%)
(0%, 0%, 57%)
(0%, 0%, 57%)
(0%, 0%, 58%)
(0%, 0%, 59%)
(0%, 0%, 60%)
(0%, 0%, 60%)
(0%, 0%, 61%)
(0%, 0%, 62%)
(0%, 0%, 63%)
(0%, 0%, 64%)
(0%, 0%, 64%)
(0%, 0%, 65%)
(0%, 0%, 66%)
(0%, 0%, 67%)
(0%, 0%, 67%)
(0%, 0%, 68%)
(0%, 0%, 69%)
(0%, 0%, 70%)
(0%, 0%, 71%)
(0%, 0%, 71%)
(0%, 0%, 72%)
(0%, 0%, 73%)
(0%, 0%, 74%)
(0%, 0%, 75%)
(0%, 0%, 75%)
(0%, 0%, 76%)
(0%, 0%, 77%)
(0%, 0%, 78%)
(0%, 0%, 78%)
(0%, 0%, 79%)
(0%, 0%, 80%)
(0%, 0%, 81%)
(0%, 0%, 82%)
(0%, 0%, 82%)
(0%, 0%, 83%)
(0%, 0%, 84%)
(0%, 0%, 85%)
(0%, 0%, 85%)
(0%, 0%, 86%)
(0%, 0%, 87%)
(0%, 0%, 88%)
(0%, 0%, 89%)
(0%, 0%, 89%)
(0%, 0%, 90%)
(0%, 0%, 91%)
(0%, 0%, 92%)
(0%, 0%, 92%)
(0%, 0%, 93%)
(0%, 0%, 94%)
(0%, 0%, 95%)
(0%, 0%, 96%)
(0%, 0%, 96%)
(0%, 0%, 97%)

***********************************************************
Modifications since last successful build:	(1)
            
add cc-hdk log20080912160216Lbuild.164 09/12/2008 16:02:16hdk


Mime
  • Unnamed multipart/mixed (inline, None, 0 bytes)
View raw message