harmony-alerts mailing list archives

Site index · List index
Message view « Date » · « Thread »
Top « Date » · « Thread »
From nom...@intel.com
Subject [build-test alert] FAILED Windows 2003 x86_64: drlvm-test debug
Date Tue, 09 Sep 2008 07:23:51 GMT

BUILD FAILED:
	Ant Error Message:
C:\harmony.cc\infra\scripts\cc-exec-adaptor.xml:68: The following error occurred while executing
this line: C:\harmony.cc\infra\adaptors\drlvm-test\adaptor.xml:81: There were drlvm-test failures

Date of build:	2008-09-08 19:34:28 -0700
Time to build:	289 minutes 13 seconds
Last changed:	09/08/2008 15:03:47
Last log entry:	hdk

***********************************************************
Errors/Warnings:	(35)
            
[cc] cl : Command line warning D9035 : option 'GZ' has been deprecated and will be removed
in a future release
[cc] cl : Command line warning D9036 : use 'RTC1' instead of 'GZ'
[cc] cl : Command line warning D9035 : option 'GZ' has been deprecated and will be removed
in a future release
[cc] cl : Command line warning D9036 : use 'RTC1' instead of 'GZ'
[cc] cl : Command line warning D9035 : option 'GZ' has been deprecated and will be removed
in a future release
[cc] cl : Command line warning D9036 : use 'RTC1' instead of 'GZ'
[cc] cl : Command line warning D9035 : option 'GZ' has been deprecated and will be removed
in a future release
[cc] cl : Command line warning D9036 : use 'RTC1' instead of 'GZ'
[cc] cl : Command line warning D9035 : option 'GZ' has been deprecated and will be removed
in a future release
[cc] cl : Command line warning D9036 : use 'RTC1' instead of 'GZ'
[cc] cl : Command line warning D9035 : option 'GZ' has been deprecated and will be removed
in a future release
[cc] cl : Command line warning D9036 : use 'RTC1' instead of 'GZ'
[cc] cl : Command line warning D9035 : option 'GZ' has been deprecated and will be removed
in a future release
[cc] cl : Command line warning D9036 : use 'RTC1' instead of 'GZ'
[java] Java Result: 1
[java] Java Result: 1
[java] Java Result: 130
[java] Java Result: 1
[java] Java Result: 1
[java] Java Result: 130
[java] Java Result: 1
[java] Java Result: 1
[java] Java Result: 130
[java] Java Result: 1
[java] Java Result: 1
[java] Java Result: 130
[java] Java Result: 1
[java] Java Result: 1
[java] Java Result: 130
[junit] Tests FAILED
BUILD FAILED
C:\harmony.cc\infra\build\checkouts\hdk\working_vm\build.xml:286: Some tests failed
Total time: 288 minutes 52 seconds
The execution FAILED with the following exception:
The following error occurred while executing this line:
C:\harmony.cc\infra\adaptors\drlvm-test\adaptor.xml:81: There were drlvm-test failures

***********************************************************
Unit Tests: (4342)
        
failure: testInterrupt_Staging java.lang.ThreadTest
Unit Test Error Details:	(1)
                
Test: testInterrupt_StagingClass: java.lang.ThreadTestjunit.framework.AssertionFailedError:
waitFor notify: stages are not synchronized before expected:<2> but was:<3>
	at junit.framework.Assert.fail(Assert.java:47)
	at junit.framework.Assert.failNotEquals(Assert.java:277)
	at junit.framework.Assert.assertEquals(Assert.java:64)
	at junit.framework.Assert.assertEquals(Assert.java:195)
	at java.lang.ThreadTest$ThreadStaging.waitStage(ThreadTest.java:1559)
	at java.lang.ThreadTest.testInterrupt_Staging(ThreadTest.java)
	at java.lang.reflect.VMReflection.invokeMethod(VMReflection.java)
	at java.lang.reflect.Method.invoke(Method.java:317)
	at junit.framework.TestCase.runTest(TestCase.java:168)
	at junit.framework.TestCase.runBare(TestCase.java)
	at junit.framework.TestResult$1.protect(TestResult.java)
	at junit.framework.TestResult.runProtected(TestResult.java)
	at junit.framework.TestResult.run(TestResult.java:113)
	at junit.framework.TestCase.run(TestCase.java:124)
	at junit.framework.TestSuite.runTest(TestSuite.java:232)
	at junit.framework.TestSuite.run(TestSuite.java)
	at org.apache.tools.ant.taskdefs.optional.junit.JUnitTestRunner.run(JUnitTestRunner.java)
	at org.apache.tools.ant.taskdefs.optional.junit.JUnitTestRunner.launch(JUnitTestRunner.java:672)
	at org.apache.tools.ant.taskdefs.optional.junit.JUnitTestRunner.main(JUnitTestRunner.java:546)

***********************************************************
Modifications since last successful build:	(1)
            
add cc-hdk log20080908150347Lbuild.80 09/08/2008 15:03:47hdk


Mime
  • Unnamed multipart/mixed (inline, None, 0 bytes)
View raw message