harmony-alerts mailing list archives

Site index · List index
Message view « Date » · « Thread »
Top « Date » · « Thread »
From nom...@intel.com
Subject [build-test alert] FAILED Linux x86_64: drlvm-reg-test debug
Date Wed, 03 Sep 2008 13:44:09 GMT

BUILD FAILED:
	Ant Error Message:
/home/laichunrong/harmony.regularcc/infra/scripts/cc-exec-adaptor.xml:68: The following error
occurred while executing this line: /home/laichunrong/harmony.regularcc/infra/adaptors/drlvm-reg-test/adaptor.xml:80:
There were drlvm-reg-test failures

Date of build:	2008-09-03 21:14:36 +0800
Time to build:	29 minutes 27 seconds
Last changed:	09/03/2008 17:40:45
Last log entry:	hdk

***********************************************************
Errors/Warnings:	(10)
            
[junit] Test org.apache.harmony.drlvm.tests.regression.h3283.JavaLibraryPathTest FAILED
[java] Java Result: 1
[java] Java Result: 1
[java] Java Result: 1
BUILD FAILED
/home/laichunrong/harmony.regularcc/infra/build/checkouts/hdk/working_vm/build.xml:352: The
following error occurred while executing this line:
/home/laichunrong/harmony.regularcc/infra/build/checkouts/hdk/working_vm/make/tests/reg-test-run.xml:108:
There were test failures
Total time: 29 minutes 10 seconds
The execution FAILED with the following exception:
The following error occurred while executing this line:
/home/laichunrong/harmony.regularcc/infra/adaptors/drlvm-reg-test/adaptor.xml:80: There were
drlvm-reg-test failures

***********************************************************
Unit Tests: (185)
        
All Tests Passed

***********************************************************
Modifications since last successful build:	(1)
            
add cc-hdk log20080903174045Lbuild.128 09/03/2008 17:40:45hdk


Mime
  • Unnamed multipart/mixed (inline, None, 0 bytes)
View raw message