harmony-alerts mailing list archives

Site index · List index
Message view « Date » · « Thread »
Top « Date » · « Thread »
From nom...@intel.com
Subject [build-test alert] FAILED Linux x86: drlvm-reg-test debug
Date Wed, 10 Sep 2008 20:38:59 GMT

BUILD FAILED:
	Ant Error Message:
/home/laichunrong/harmony.regularcc/infra/scripts/cc-exec-adaptor.xml:68: The following error
occurred while executing this line: /home/laichunrong/harmony.regularcc/infra/adaptors/drlvm-reg-test/adaptor.xml:80:
There were drlvm-reg-test failures

Date of build:	2008-09-11 04:10:48 +0800
Time to build:	28 minutes 7 seconds
Last changed:	09/11/2008 03:36:38
Last log entry:	hdk

***********************************************************
Errors/Warnings:	(10)
            
[java] Java Result: 1
[java] Java Result: 1
[java] Java Result: 1
[junit] Test org.apache.harmony.drlvm.tests.regression.h5480.LooseMathTest FAILED
BUILD FAILED
/home/laichunrong/harmony.regularcc/infra/build/checkouts/hdk/working_vm/build.xml:352: The
following error occurred while executing this line:
/home/laichunrong/harmony.regularcc/infra/build/checkouts/hdk/working_vm/make/tests/reg-test-run.xml:108:
There were test failures
Total time: 27 minutes 52 seconds
The execution FAILED with the following exception:
The following error occurred while executing this line:
/home/laichunrong/harmony.regularcc/infra/adaptors/drlvm-reg-test/adaptor.xml:80: There were
drlvm-reg-test failures

***********************************************************
Unit Tests: (194)
        
failure: testTAN org.apache.harmony.drlvm.tests.regression.h5480.LooseMathTest
Unit Test Error Details:	(1)
                
Test: testTANClass: org.apache.harmony.drlvm.tests.regression.h5480.LooseMathTestjunit.framework.AssertionFailedError:
d=5.4619684319966756E7 ulp=1.0E-9 expected:<444.0662596414955> but was:<444.06625965536193>
	at org.apache.harmony.drlvm.tests.regression.h5480.LooseMathTest.testTAN(LooseMathTest.java:79)
	at java.lang.reflect.VMReflection.invokeMethod(VMReflection.java)

***********************************************************
Modifications since last successful build:	(1)
            
add cc-hdk log20080911033638Lbuild.161 09/11/2008 03:36:38hdk


Mime
  • Unnamed multipart/mixed (inline, None, 0 bytes)
View raw message