harmony-alerts mailing list archives

Site index · List index
Message view « Date » · « Thread »
Top « Date » · « Thread »
From nom...@intel.com
Subject [build-test alert] FAILED Windows 2003 x86_64: hdk debug
Date Mon, 11 Aug 2008 17:05:16 GMT

BUILD FAILED:
	Ant Error Message:
C:\harmony.cc\infra\scripts\cc-exec-adaptor.xml:68: The following error occurred while executing
this line: C:\harmony.cc\infra\adaptors\hdk\adaptor.xml:35: exec returned: 1

Date of build:	2008-08-11 09:50:49 -0700
Time to build:	1 minute 53 seconds
Last changed:	08/10/2008 18:44:42
Last log entry:	update yoko related jars to new locations.

***********************************************************
Errors/Warnings:	(3)
            
svn: PROPFIND request failed on '/repos/asf/!svn/bln/684623'
svn: PROPFIND of '/repos/asf/!svn/bln/684623': could not connect to server (http://svn.apache.org)
The execution FAILED with the following exception:
The following error occurred while executing this line:
C:\harmony.cc\infra\adaptors\hdk\adaptor.xml:35: exec returned: 1

***********************************************************
Unit Tests: (0)
        
No Tests Run: This project doesn't have any tests

***********************************************************
Modifications since last successful build:	(1)
            
modified qiuxx  /harmony/enhanced/classlib/trunk/make/depends.properties 08/10/2008 18:44:42
update yoko related jars to new locations.


Mime
  • Unnamed multipart/mixed (inline, None, 0 bytes)
View raw message