harmony-alerts mailing list archives

Site index · List index
Message view « Date » · « Thread »
Top « Date » · « Thread »
From nom...@intel.com
Subject [build-test alert] FAILED Linux x86_64: hdk debug
Date Mon, 04 Aug 2008 15:47:40 GMT

BUILD FAILED:
	Ant Error Message:
/home/laichunrong/harmony.regularcc/infra/scripts/cc-exec-adaptor.xml:68: The following error
occurred while executing this line: /home/laichunrong/harmony.regularcc/infra/adaptors/hdk/adaptor.xml:39:
The following error occurred while executing this line: /home/laichunrong/harmony.regularcc/infra/scripts/framework.xml:163:
Java returned: 1

Date of build:	2008-08-04 23:29:23 +0800
Time to build:	17 minutes 30 seconds
Last changed:	08/04/2008 22:57:13
Last log entry:	Apply patch for HARMONY-5927 (Progress on policytool)

***********************************************************
Errors/Warnings:	(11)
            
[cc] /usr/bin/ar: creating libencoder.a
[cc] /usr/bin/ar: creating libport.a
[cc] /usr/bin/ar: creating libverifier.a
BUILD FAILED
/home/laichunrong/harmony.regularcc/infra/build/checkouts/hdk/build.xml:504: The following
error occurred while executing this line:
/home/laichunrong/harmony.regularcc/infra/build/checkouts/hdk/working_jdktools/build.xml:82:
The following error occurred while executing this line:
/home/laichunrong/harmony.regularcc/infra/build/checkouts/hdk/working_jdktools/make/build-java.xml:49:
The following error occurred while executing this line:
/home/laichunrong/harmony.regularcc/infra/build/checkouts/hdk/common_resources/make/properties.xml:242:
The following error occurred while executing this line:
/home/laichunrong/harmony.regularcc/infra/build/checkouts/hdk/working_jdktools/modules/tools/build.xml:92:
Compile failed; see the compiler error output for details.
Total time: 16 minutes 26 seconds
The execution FAILED with the following exception:
The following error occurred while executing this line:
/home/laichunrong/harmony.regularcc/infra/adaptors/hdk/adaptor.xml:39: The following error
occurred while executing this line:
/home/laichunrong/harmony.regularcc/infra/scripts/framework.xml:163: Java returned: 1

***********************************************************
Unit Tests: (0)
        
No Tests Run: This project doesn't have any tests

***********************************************************
Modifications since last successful build:	(9)
            
modified odeakin  /harmony/enhanced/jdktools/trunk/modules/tools/src/main/java/org/apache/harmony/tools/policytool/view/ListAndEditPanel.java
08/04/2008 22:57:13 Apply patch for HARMONY-5927 (Progress on policytool)
modified odeakin  /harmony/enhanced/jdktools/trunk/modules/tools/src/main/java/org/apache/harmony/tools/policytool/model/Principal.java
08/04/2008 22:57:13 Apply patch for HARMONY-5927 (Progress on policytool)
modified odeakin  /harmony/enhanced/jdktools/trunk/modules/tools/src/main/java/org/apache/harmony/tools/policytool/view/GrantEntryEditFormDialog.java
08/04/2008 22:57:13 Apply patch for HARMONY-5927 (Progress on policytool)
modified odeakin  /harmony/enhanced/jdktools/trunk/modules/tools/src/main/java/org/apache/harmony/tools/policytool/control/Controller.java
08/04/2008 22:57:13 Apply patch for HARMONY-5927 (Progress on policytool)
modified odeakin  /harmony/enhanced/jdktools/trunk/modules/tools/src/main/java/org/apache/harmony/tools/policytool/view/PrincipalEditFormDialog.java
08/04/2008 22:57:13 Apply patch for HARMONY-5927 (Progress on policytool)
modified odeakin  /harmony/enhanced/jdktools/trunk/modules/tools/src/main/java/org/apache/harmony/tools/policytool/model/Permission.java
08/04/2008 22:57:13 Apply patch for HARMONY-5927 (Progress on policytool)
modified odeakin  /harmony/enhanced/jdktools/trunk/modules/tools/src/main/java/org/apache/harmony/tools/policytool/view/BaseFormDialog.java
08/04/2008 22:57:13 Apply patch for HARMONY-5927 (Progress on policytool)
modified odeakin  /harmony/enhanced/jdktools/trunk/modules/tools/src/main/java/org/apache/harmony/tools/policytool/view/GraphicalEditorPanel.java
08/04/2008 22:57:13 Apply patch for HARMONY-5927 (Progress on policytool)
modified odeakin  /harmony/enhanced/jdktools/trunk/modules/tools/src/main/java/org/apache/harmony/tools/policytool/view/KeystoreEntryEditFormDialog.java
08/04/2008 22:57:13 Apply patch for HARMONY-5927 (Progress on policytool)


Mime
  • Unnamed multipart/mixed (inline, None, 0 bytes)
View raw message