harmony-alerts mailing list archives

Site index · List index
Message view « Date » · « Thread »
Top « Date » · « Thread »
From nom...@intel.com
Subject [build-test alert] FAILED Linux x86: classlib-test debug
Date Thu, 28 Aug 2008 14:31:05 GMT

BUILD FAILED:
	Ant Error Message:
/home/laichunrong/harmony.regularcc/infra/scripts/cc-exec-adaptor.xml:68: The following error
occurred while executing this line: /home/laichunrong/harmony.regularcc/infra/adaptors/classlib-test/adaptor.xml:92:
There were CLASSLIB Unit Test failures.

Date of build:	2008-08-28 22:10:07 +0800
Time to build:	20 minutes 49 seconds
Last changed:	08/28/2008 21:29:46
Last log entry:	hdk

***********************************************************
Errors/Warnings:	(37)
            
Checking depends/jars/yoko-1.0/yoko.jar
Checksum verified (true)
Checking depends/jars/yoko-1.0/yoko-core.jar
Checksum verified (true)
Checking depends/jars/yoko-1.0/yoko-rmi-impl.jar
Checksum verified (true)
Checking depends/jars/yoko-1.0/yoko-rmi-spec.jar
Checksum verified (true)
Checking depends/jars/bcel-5.2/bcel-5.2.jar
Checksum verified (true)
Checking depends/jars/xalan-j_2.7.0/xalan.jar
Checksum verified (true)
Checking depends/jars/xerces_2.9.1/xerces.zip
Checksum verified (true)
Checking depends/jars/junit_4.4/junit.jar
Checksum verified (true)
Checking depends/jars/bcprov-jdk15-139/bcprov.noidea.jar
Checksum verified (true)
Checking depends/jars/mx4j_3.0.2/mx4j.zip
Checksum verified (true)
Checking depends/jars/jetty/jetty-6.0.0.jar
Checksum verified (true)
Checking depends/jars/jetty/jetty-util-6.0.0.jar
Checksum verified (true)
Checking depends/jars/jetty/servlet-api-2.5-6.0.0.jar
Checksum verified (true)
Checking depends/dejavu-fonts/dejavu-ttf-2.18-1.zip
Checksum verified (true)
Checking depends/jars/derby-10.3.1.4/derby.jar
Checksum verified (true)
[junit] Tests FAILED
BUILD FAILED
/home/laichunrong/harmony.regularcc/infra/build/checkouts/hdk/working_classlib/build.xml:169:
The following error occurred while executing this line:
/home/laichunrong/harmony.regularcc/infra/build/checkouts/hdk/working_classlib/make/build-test.xml:140:
There were test failures.
Total time: 17 minutes 53 seconds
The execution FAILED with the following exception:
The following error occurred while executing this line:
/home/laichunrong/harmony.regularcc/infra/adaptors/classlib-test/adaptor.xml:92: There were
CLASSLIB Unit Test failures.

***********************************************************
Unit Tests: (15809)
        
failure: testGolden org.apache.harmony.auth.tests.javax.security.auth.kerberos.serialization.KrbDelegationPermissionCollectionTest
failure: testGolden org.apache.harmony.auth.tests.javax.security.auth.kerberos.serialization.KrbServicePermissionCollectionTest
Unit Test Error Details:	(2)
                
Test: testGoldenClass: org.apache.harmony.auth.tests.javax.security.auth.kerberos.serialization.KrbDelegationPermissionCollectionTestjunit.framework.AssertionFailedError:
expected:<[(javax.security.auth.kerberos.DelegationPermission "AAA" "BBB"), (javax.security.auth.kerberos.DelegationPermission
"AAA" "CCC"), (javax.security.auth.kerberos.DelegationPermission "BBB" "CCC")]> but was:<[(javax.security.auth.kerberos.DelegationPermission
"BBB" "CCC"), (javax.security.auth.kerberos.DelegationPermission "AAA" "CCC"), (javax.security.auth.kerberos.DelegationPermission
"AAA" "BBB")]>
	at org.apache.harmony.testframework.serialization.SerializationTest$4.assertDeserialized(SerializationTest.java:318)
	at org.apache.harmony.testframework.serialization.SerializationTest.verifyGolden(SerializationTest.java:513)
	at org.apache.harmony.testframework.serialization.SerializationTest.verifyGolden(SerializationTest.java:485)
	at org.apache.harmony.testframework.serialization.SerializationTest.testGolden(SerializationTest.java:146)
	at java.lang.reflect.VMReflection.invokeMethod(VMReflection.java)
	at org.apache.harmony.testframework.serialization.SerializationTest.runBare(SerializationTest.java:113)
Test: testGoldenClass: org.apache.harmony.auth.tests.javax.security.auth.kerberos.serialization.KrbServicePermissionCollectionTestjunit.framework.AssertionFailedError:
expected:<[(javax.security.auth.kerberos.ServicePermission AAA accept), (javax.security.auth.kerberos.ServicePermission
BBB initiate), (javax.security.auth.kerberos.ServicePermission CCC initiate,accept)]> but
was:<[(javax.security.auth.kerberos.ServicePermission CCC initiate,accept), (javax.security.auth.kerberos.ServicePermission
BBB initiate), (javax.security.auth.kerberos.ServicePermission AAA accept)]>
	at org.apache.harmony.testframework.serialization.SerializationTest$4.assertDeserialized(SerializationTest.java:318)
	at org.apache.harmony.testframework.serialization.SerializationTest.verifyGolden(SerializationTest.java:513)
	at org.apache.harmony.testframework.serialization.SerializationTest.verifyGolden(SerializationTest.java:485)
	at org.apache.harmony.testframework.serialization.SerializationTest.testGolden(SerializationTest.java:146)
	at java.lang.reflect.VMReflection.invokeMethod(VMReflection.java)
	at org.apache.harmony.testframework.serialization.SerializationTest.runBare(SerializationTest.java:113)

***********************************************************
Modifications since last successful build:	(1)
            
add cc-hdk log20080828212946Lbuild.134 08/28/2008 21:29:46hdk


Mime
  • Unnamed multipart/mixed (inline, None, 0 bytes)
View raw message