harmony-alerts mailing list archives

Site index · List index
Message view « Date » · « Thread »
Top « Date » · « Thread »
From nom...@intel.com
Subject [build-test alert] FAILED Linux x86: drlvm-reg-test debug
Date Wed, 16 Jul 2008 12:41:09 GMT

BUILD FAILED:
	Ant Error Message:
/home/laichunrong/harmony.regularcc/infra/scripts/cc-exec-adaptor.xml:68: The following error
occurred while executing this line: /home/laichunrong/harmony.regularcc/infra/adaptors/drlvm-reg-test/adaptor.xml:80:
There were drlvm-reg-test failures

Date of build:	2008-07-16 20:14:18 +0800
Time to build:	26 minutes 48 seconds
Last changed:	07/16/2008 17:35:31
Last log entry:	hdk

***********************************************************
Errors/Warnings:	(10)
            
[java] Java Result: 1
[java] Java Result: 1
[java] Java Result: 1
[junit] Test org.apache.harmony.drlvm.tests.regression.h5480.LooseMathTest FAILED
BUILD FAILED
/home/laichunrong/harmony.regularcc/infra/build/checkouts/hdk/working_vm/build.xml:352: The
following error occurred while executing this line:
/home/laichunrong/harmony.regularcc/infra/build/checkouts/hdk/working_vm/make/tests/reg-test-run.xml:108:
There were test failures
Total time: 26 minutes 37 seconds
The execution FAILED with the following exception:
The following error occurred while executing this line:
/home/laichunrong/harmony.regularcc/infra/adaptors/drlvm-reg-test/adaptor.xml:80: There were
drlvm-reg-test failures

***********************************************************
Unit Tests: (194)
        
failure: testTAN org.apache.harmony.drlvm.tests.regression.h5480.LooseMathTest
Unit Test Error Details:	(1)
                
Test: testTANClass: org.apache.harmony.drlvm.tests.regression.h5480.LooseMathTestjunit.framework.AssertionFailedError:
d=-1.1079247638851452E9 ulp=1.0E-9 expected:<-42.3415094641288> but was:<-42.341509466687405>
	at org.apache.harmony.drlvm.tests.regression.h5480.LooseMathTest.testTAN(LooseMathTest.java:79)
	at java.lang.reflect.VMReflection.invokeMethod(VMReflection.java)

***********************************************************
Modifications since last successful build:	(1)
            
add cc-hdk log20080716173531Lbuild.91 07/16/2008 17:35:31hdk


Mime
  • Unnamed multipart/mixed (inline, None, 0 bytes)
View raw message