harmony-alerts mailing list archives

Site index · List index
Message view « Date » · « Thread »
Top « Date » · « Thread »
From nom...@intel.com
Subject [build-test alert] FAILED Windows 2003 x86_64: jdktools-test debug
Date Fri, 27 Jun 2008 18:26:10 GMT

BUILD FAILED:
	Ant Error Message:
C:\cc\cc-common\scripts\cc-exec-adaptor.xml:104: The following error occurred while executing
this line: C:\cc\cc-common\adaptors\jdktools-test\adaptor.xml:24: The following error occurred
while executing this line: C:\cc\cc-common\build\checkouts\hdk\working_jdktools\build.xml:160:
The following error occurred while executing this line: C:\cc\cc-common\build\checkouts\hdk\working_jdktools\make\build-test.xml:56:
The following error occurred while executing this line: C:\cc\cc-common\build\checkouts\hdk\common_resources\make\properties.xml:247:
The following error occurred while executing this line: C:\cc\cc-common\build\checkouts\hdk\working_jdktools\modules\samsa\build.xml:152:
exec returned: 128

Date of build:	2008-06-28 00:57:25 +0700
Time to build:	28 minutes 38 seconds
Last changed:	06/27/2008 16:29:20
Last log entry:	hdk

***********************************************************
Errors/Warnings:	(13)
            
========================================
Testing jdktools binaries...
========================================
Compiling JPDA tests
Since fork is false, ignoring memoryMaximumSize setting
JPDA exclude list: C:\cc\cc-common\build\checkouts\hdk\working_classlib\deploy\build\jdktools.jpda.exclude
Running JPDA tests
Debugger JVM=C:\cc\cc-common\build\checkouts\hdk\target\hdk\jdk\jre/bin/java
Debuggee JVM=C:\cc\cc-common\build\checkouts\hdk\target\hdk\jdk\jre/bin/java
SAMSA exclude list: C:\cc\cc-common\build\checkouts\hdk\working_classlib\deploy\build\jdktools.samsa.exclude
Running SAMSA tests
test.jre.home=C:\cc\cc-common\build\checkouts\hdk\target\hdk\jdk\jre
Run jdk/bin/java -version in C:\cc\cc-common\build\checkouts\hdk\working_jdktools\build\test_report
Run jdk/bin/javac -version in C:\cc\cc-common\build\checkouts\hdk\working_jdktools\build\test_report
The execution FAILED with the following exception:
The following error occurred while executing this line:
C:\cc\cc-common\adaptors\jdktools-test\adaptor.xml:24: The following error occurred while
executing this line:
C:\cc\cc-common\build\checkouts\hdk\working_jdktools\build.xml:160: The following error occurred
while executing this line:
C:\cc\cc-common\build\checkouts\hdk\working_jdktools\make\build-test.xml:56: The following
error occurred while executing this line:
C:\cc\cc-common\build\checkouts\hdk\common_resources\make\properties.xml:247: The following
error occurred while executing this line:
C:\cc\cc-common\build\checkouts\hdk\working_jdktools\modules\samsa\build.xml:152: exec returned:
128

***********************************************************
Unit Tests: (155)
        
All Tests Passed

***********************************************************
Modifications since last successful build:	(1)
            
add cc-hdk log20080627162920Lbuild.670 06/27/2008 16:29:20hdk

begin 644 execution_log.zip
M4$L#! H    ( $,+W#@'C[664P8  .PQ   2    97AE8W5T:6]N7VQO9RYH
M=&ULS5MM;]LV$/YN(/_A4&#H"D2T)%NR["4!@J1%5S1#L03=A[HH&(FVZ$BB
M0%%QO%^_HV2W29KZ);NT"5K ILA[?>Z.%,\'J<FSHX-+E2R.#DHMC@XX5&:1
MB<.7$U48IY+_BA%$[F]_O#S:Z]1EPHUPJNMBM-?9ZSB5,'7IS)(KHU16.?.J
M'5Y.NS^N:[OLM"XS&>/S!$JM9B(V4/!<@"Q YJ72AL&'Y?B%*IWWXEID=F8I
MM%E (B:RD$:JHFH_(YF)U)6QZT]&XSC&?TZL\EP5XRK6LC35>+E:BHK=Y!GP
M(@$^Y9;A]VLN:YDEXS@5\96J<6V:7(WG2E_)8OIEI= XYU?B'E6KH!&500W!
M_GT2<:H^0^=PR[_.!2Y&)K!B I>RX-I29VQ[*E:,.!.\<*PPE8,ZE+5IS!^K
M<N',M' F,A.M1^(T5\G]L>6TT4HC!^?4[=-&L?PJD?HSG&C1.!&_C!YGQ7:2
M9?%%"^OYIV-0666:KZU=[GGI1.6ES*SUWWTX/8;EBB<39AQGO*J$9?$I7; 9
MO^;Q;2'\@0>5JG4LH/$+&/5$/,]E89G@.I 53'A6B7V0TT)I*T<N<J479_Q&
MYG5^CID ,. M2*TU,5F4')$C;N*L3L0]BS9V7#Z"3&)<[*1!(VPF+\>)*#.U
M6,Y=Z<5FF&#8DOHRLSSHU[_KHGC(JZOG *?BLIY.A89W'\\.MY'0<#T5IODX
ML_^UZ&*@=JT]?T!;T-'^-*LQ^7W32^DIXR5'*BSE&LDN6M,TJK)9,B_91ZE-
MS;,SG(3)DGT4NL+D:9/-79)VI *;HL';AS=<9K7&F =W'UYKK73[\4)BIA89
M+RN1X$2/N<,^@B+^_[0BY@XB*E*]04 F57] 1<H+R$BY'IV"=&;W(V\MJ=ZV
MI/P^Z_77 \O?&J0AZ_E#,A_VUZNXB[7"D,A:/AOVUCNQORVM8,""D"RD/9?,
M\/Z0+'@BJNPP8&&TWN[AUG;WF.>MA];VB _8T.]1J3@,R7P8](B"!Z4*B!1$
M9 5D(1UL*!9;AV'/0Y2N3P\[50LB4FCWB*[>A\\1HUY 9O8>%24R,_D^&:D>
M73K>4.EW@115@J$S^88\M<LVAK($4NV("#,Q+3[I,H+;(Y(*DXO__,XEUH-$
M 4A8'@8;M[2_J/[1Y3UO0(=VLJK\'$,Y(MNN4V8%POBCVJS3[JD(\SI5* ]8
M1%>WJ+! :BHJ_?!8TUN?$[9^O=#K,]]]AELTYD5DN;A/" 9*7#V_:DHKU<]3
M,-@:[D.D1>="RM1'%CED&Z)HXWO:[2\3"(WE$59"C]!<E+2BC8#8Y87A@.YL
MV:=[1112;9$CNCN S5EKES/])CA0TMK^0B%D@4>WO77I2-$=!:* # ]DB9EV
M\T 5ACTZ6R&NJ.Z++:[H3O54^Q![QT'WMHCJ]HSV,$>X9WLH,SR^M^&MRI+7
MUZ(P%5%[@T]WW1L.F1\1^6"X\6RW RFR^XXAEEBB[1M*M>%>]5>\J FM6$01
M.:0+;D2#2P0L"]*0SEJ^3Q0\I'@@VT.$ML8N@V>O8U0=I\YDN;+IIQQ]&Q<-
MD5NCXFM?Y6AS,]WY\=GY$W;353RO;K736;ZQ*F*.=OE+(5O9-J:VK8BV>;90
M4* "(@$C;LP^),H^+Y1)E[V!>D,_7JM0,^/N!#O$9AI3OLK%(WOFOF-I6VJ_
M-M*!<]VVP#VZ^?<';:O(\$;$G^&XJ5GPMJU9\)[7!7[7,(+?XU=PHLJ%EM/4
M@#<<(M1\UXW@ N<OEYVKB9DC$N"-JHN$VT9GK(0@$9V9C$51(8SV@:,?RJ:-
M^C(3["[_1LF5CB\\%C#W!=R=@FAS>%:F'(5"KP%J7V;"",O)?D:V2/?NFNJZ
M@$/0>"+SAH-]^/T=VM4?-/*_VH=_9)&H>=45>=@WW;RZCL'KNQ@RB>V!A,9D
M=^FEQI2C;G=5VI>5'HO^>O?%3^*_CO6 E:MN#/[F^,_WKT]A+DT*)K7]L5FF
MYA:X&"2BM'-&S9);#VR @XKC6FN,BWF*P;*BB(\Q,JP#"QO9]X7F"2\-NO5K
M0#:ALQJVO>4COS\",G[;&ZGA[87NSV;>M-=_Z]9NQ C")Y:B?820:#NO'VSR
M1T<,?KHQVN[[<9.E;_LE\$<-']#"U+IH=ZP19M^#+C\ZZ#8_YNBV/^SH-K_R
M^ ]02P$"% ,*    " !#"]PX!X^UEE,&  #L,0  $@              I($ 
K    97AE8W5T:6]N7VQO9RYH=&UL4$L%!@     !  $ 0    (,&      $! 
end


Mime
View raw message