harmony-alerts mailing list archives

Site index · List index
Message view « Date » · « Thread »
Top « Date » · « Thread »
From nom...@intel.com
Subject [build-test alert] FAILED Linux x86: classlib debug
Date Wed, 11 Jun 2008 20:38:39 GMT

BUILD FAILED:
	Ant Error Message:
/export/users/cc/cc-short/scripts/cc-exec-adaptor.xml:104: exec returned: 1

Date of build:	2008-06-12 03:38:08 +0700
Time to build:	14 seconds
Last changed:	06/12/2008 03:12:24
Last log entry:	Remove unused variable.

***********************************************************
Errors/Warnings:	(6)
            
[cc-ant]: Test Suite 'classlib' execution. Repository updated: true
[cc-ant]: Result: failed.superiors = '${failed.superiors}'
[cc-ant]: Do cleanup for /export/users/cc/cc-short/build/checkouts/classlib
svn: PROPFIND request failed on '/repos/asf/!svn/vcc/default'
svn: PROPFIND of '/repos/asf/!svn/vcc/default': 502 Bad Gateway (http://svn.apache.org)
The execution FAILED with the following exception:
exec returned: 1

***********************************************************
Unit Tests: (0)
        
No Tests Run: This project doesn't have any tests

***********************************************************
Modifications since last successful build:	(1)
            
modified hindessm  /harmony/enhanced/classlib/trunk/modules/portlib/src/main/native/port/unix/hyshmem.c
06/12/2008 03:12:24 Remove unused variable.

begin 644 execution_log.zip
M4$L#! H    ( -$<S#A9M6FF%@$  )P!   2    97AE8W5T:6]N7VQO9RYH
M=&UL?9%-2P,Q$(;O^RO&@ZP>MJF"('%=4&JE(%K$6^DA329-,&YB,NFV_GJS
M%:\=YC3SS+SST1KZ<EV[\>K0M2%BUPI(='!X7VO?4Y/L#W*XG9[?U5V5@Q*$
M3=KUO(+15BB-7\-*RD;TM.8P\R =BCX'T#X"PWWPD5A.&!.3LGB3S!C99.L4
MDP;EI\]4<DZDY.SFO^\>Y1I&(5B^ORWGB]<91/S.F BTL X5^!YJ%C'XQ$32
M[*S ;%<D%&J1'=4G.GE]NI3#S?0:'H6"Y[+O( YP88@"9ZR0$Q%$F7OBX_:R
MJCX,PBB1R9:!Y@^+EZ<9#)8,4,EH[YP?;+\MC,0P,KP:\;(,Y=BCXG!5M4QT
M+3L>G_T]@AV_\@M02P$"% ,*    " #1',PX6;5IIA8!  "< 0  $@      
M        I($     97AE8W5T:6]N7VQO9RYH=&UL4$L%!@     !  $ 0   
' $8!      $! 
end


Mime
View raw message