harmony-alerts mailing list archives

Site index · List index
Message view « Date » · « Thread »
Top « Date » · « Thread »
From nom...@intel.com
Subject [build-test alert] FAILED Linux x86: hdk debug
Date Wed, 04 Jun 2008 15:03:27 GMT

BUILD FAILED:
	Ant Error Message:
/export/users/cc/cc-common/scripts/cc-exec-adaptor.xml:104: The following error occurred while
executing this line: /export/users/cc/cc-common/adaptors/hdk/adaptor.xml:48: The following
error occurred while executing this line: /export/users/cc/cc-common/scripts/framework.xml:1079:
Java returned: 1

Date of build:	2008-06-04 22:01:54 +0700
Time to build:	1 minute 12 seconds
Last changed:	06/04/2008 21:46:12
Last log entry:	Use trivial portlib stubs on zos and aix to avoid porting unused code.

***********************************************************
Errors/Warnings:	(6)
            
BUILD FAILED
/export/users/cc/cc-common/build/checkouts/hdk/build.xml:434: The following error occurred
while executing this line:
/export/users/cc/cc-common/build/checkouts/hdk/working_classlib/make/build-native.xml:29:
The following error occurred while executing this line:
/export/users/cc/cc-common/build/checkouts/hdk/working_classlib/make/properties.xml:320: The
element type "or" must be terminated by the matching end-tag "</or>".
Total time: 3 seconds
The execution FAILED with the following exception:
The following error occurred while executing this line:
/export/users/cc/cc-common/adaptors/hdk/adaptor.xml:48: The following error occurred while
executing this line:
/export/users/cc/cc-common/scripts/framework.xml:1079: Java returned: 1

***********************************************************
Unit Tests: (0)
        
No Tests Run: This project doesn't have any tests

***********************************************************
Modifications since last successful build:	(4)
            
modified hindessm  /harmony/enhanced/classlib/trunk/make/properties.xml 06/04/2008 21:46:12
Use trivial portlib stubs on zos and aix to avoid porting unused code.
modified iberezhn  /harmony/enhanced/drlvm/trunk/vm/port/src/thread/win/thread_os.c 06/04/2008
20:07:09 Applied patch from HARMONY-5859[drlvm][signals] Regression test H4265 fails after
r660062 commit
modified iberezhn  /harmony/enhanced/drlvm/trunk/vm/vmcore/src/exception/exceptions_jit.cpp
06/04/2008 20:07:09 Applied patch from HARMONY-5859[drlvm][signals] Regression test H4265
fails after r660062 commit
modified iberezhn  /harmony/enhanced/drlvm/trunk/vm/port/src/signals/win/signals_common.cpp
06/04/2008 20:07:09 Applied patch from HARMONY-5859[drlvm][signals] Regression test H4265
fails after r660062 commit

begin 644 execution_log.zip
M4$L#! H    ( &JPQ#C_6"9'\0$  !<%   2    97AE8W5T:6]N7VQO9RYH
M=&ULS51-;]LP#+W[5Q !AIX<Y:/K.L\SL*(;T*'']C04@2(SL1I]0:*=9+]^
MLMQL#;!F0W>9(1@41)&/CT\L&]*J*I>VWE>E\UB5' +M%7X\6UE#>9#?L8#+
MR9L/9U76NIH3YJ$S19;Y-OZA_[[A#L4#W/?VUOJ--.M%IUE<SGIBP0L6Y-IP
M%=A6FH.]$%9K:\;"N;\.0XU'7J<H@[FP82S^=+W3PGI, 7 GT)&TYI<5%H^2
M3J,0BH>@Y))IOD'FO'7H26(8[[0ZOI4(JH$L>.QDB.'AXF(^?3L;/_D]\HX_
MP%4K5;V2*E*[[,UG@0:'HXTTDO(#AKRI-\7+OE?W-[?7\.73S>WGZZ.#6'"B
ML0WH Q,BKGSH $L0F&A0;&Q+@<4,[">LXGQ^7L!=@["R2ME(_1K0>^O!"M%Z
M'ZO=-K$2Z!EHJ3^F1@90TF#Q+PA^3W[RS TGV6&"-WO_'Z$[ED8QGTT&<*A0
MHR&@O4,863\"W0:")0*AU](DT2SW$1N"YB2:5(>I<^)K&)7,^FHT?KGI=Y:X
M I(ZZFD. 84U=<BRE'FH.^IPT 1L)34ISS/"#D^AR%[+Y GV>,T=63_0]K09
MA'7Y^LZ=R!>$ERYV:>6YQKY-*=ET\BX*Y6ND*[Y,:KW!NH!I5C)>E2S-/3;,
M0)8&X@]02P$"% ,*    " !JL,0X_U@F1_$!   7!0  $@              
MI($     97AE8W5T:6]N7VQO9RYH=&UL4$L%!@     !  $ 0    "$"    
!  $! 
end


Mime
View raw message