harmony-alerts mailing list archives

Site index · List index
Message view « Date » · « Thread »
Top « Date » · « Thread »
From nom...@intel.com
Subject [build-test alert] FAILED Windows 2003 x86_64: jdktools-test debug
Date Wed, 04 Jun 2008 11:47:21 GMT

BUILD FAILED:
	Ant Error Message:
C:\cc\cc-common\scripts\cc-exec-adaptor.xml:104: The following error occurred while executing
this line: C:\cc\cc-common\adaptors\jdktools-test\adaptor.xml:24: The following error occurred
while executing this line: C:\cc\cc-common\build\checkouts\hdk\working_jdktools\build.xml:160:
The following error occurred while executing this line: C:\cc\cc-common\build\checkouts\hdk\working_jdktools\make\build-test.xml:93:
There were test errors.

Date of build:	2008-06-04 16:35:24 +0700
Time to build:	131 minutes 49 seconds
Last changed:	05/29/2008 01:04:12
Last log entry:	hdk

***********************************************************
Errors/Warnings:	(27)
            
Result: 1
Tests FAILED (timeout)
========================================
Testing jdktools binaries...
========================================
Compiling JPDA tests
Since fork is false, ignoring memoryMaximumSize setting
JPDA exclude list: C:\cc\cc-common\build\checkouts\hdk\working_classlib\deploy\build\jdktools.jpda.exclude
Running JPDA tests
Debugger JVM=C:\cc\cc-common\build\checkouts\hdk\target\hdk\jdk\jre/bin/java
Debuggee JVM=C:\cc\cc-common\build\checkouts\hdk\target\hdk\jdk\jre/bin/java
SAMSA exclude list: C:\cc\cc-common\build\checkouts\hdk\working_classlib\deploy\build\jdktools.samsa.exclude
Running SAMSA tests
test.jre.home=C:\cc\cc-common\build\checkouts\hdk\target\hdk\jdk\jre
Run jdk/bin/java -version in C:\cc\cc-common\build\checkouts\hdk\working_jdktools\build\test_report
Run jdk/bin/javac -version in C:\cc\cc-common\build\checkouts\hdk\working_jdktools\build\test_report
Run jdk/bin/javah in C:\cc\cc-common\build\checkouts\hdk\working_jdktools\build\test_report
Run jdk/bin/javadoc in C:\cc\cc-common\build\checkouts\hdk\working_jdktools\build\test_report
Run jdk/bin/jarsigner in C:\cc\cc-common\build\checkouts\hdk\working_jdktools\build\test_report
Run jdk/bin/keytool -help in C:\cc\cc-common\build\checkouts\hdk\working_jdktools\build\test_report
Run jdk/bin/unpack200 in C:\cc\cc-common\build\checkouts\hdk\working_jdktools\build\test_report
Compiling TOOLS tests
Since fork is false, ignoring memoryMaximumSize setting
TOOLS exclude list: C:\cc\cc-common\build\checkouts\hdk\working_classlib\deploy\build\jdktools.tools.exclude
Running TOOLS tests
test.jre.home=C:\cc\cc-common\build\checkouts\hdk\target\hdk\jdk\jre
The test report is in C:\cc\cc-common\build\checkouts\hdk\working_jdktools\build\test_report\html\index.html
The execution FAILED with the following exception:
The following error occurred while executing this line:
C:\cc\cc-common\adaptors\jdktools-test\adaptor.xml:24: The following error occurred while
executing this line:
C:\cc\cc-common\build\checkouts\hdk\working_jdktools\build.xml:160: The following error occurred
while executing this line:
C:\cc\cc-common\build\checkouts\hdk\working_jdktools\make\build-test.xml:93: There were test
errors.

***********************************************************
Unit Tests: (158)
        
error: org.apache.harmony.tools.keytool.tests.GenKeyTest vmcrash.CrashedTests
error: testDisableCollection001 org.apache.harmony.jpda.tests.jdwp.ObjectReference.DisableCollectionTest
Unit Test Error Details:	(2)
                
Test: org.apache.harmony.tools.keytool.tests.GenKeyTestClass: vmcrash.CrashedTests
Test: testDisableCollection001Class: org.apache.harmony.jpda.tests.jdwp.ObjectReference.DisableCollectionTestorg.apache.harmony.jpda.tests.framework.TestErrorException:
Debuggee process did not finish during timeout
	at org.apache.harmony.jpda.tests.jdwp.share.JDWPUnitDebuggeeProcessWrapper.WaitForProcessExit(JDWPUnitDebuggeeProcessWrapper.java:284)
	at org.apache.harmony.jpda.tests.jdwp.share.JDWPUnitDebuggeeProcessWrapper.finishProcessAndRedirectors(JDWPUnitDebuggeeProcessWrapper.java:87)
	at org.apache.harmony.jpda.tests.jdwp.share.JDWPUnitDebuggeeWrapper.stop(JDWPUnitDebuggeeWrapper.java:109)
	at org.apache.harmony.jpda.tests.jdwp.share.JDWPTestCase.internalTearDown(JDWPTestCase.java:108)
	at org.apache.harmony.jpda.tests.jdwp.share.JDWPSyncTestCase.internalTearDown(JDWPSyncTestCase.java:83)
	at org.apache.harmony.jpda.tests.jdwp.share.JDWPRawTestCase.tearDown(JDWPRawTestCase.java:118)
Caused by: java.lang.IllegalThreadStateException: process has not exited
	at java.lang.Runtime$SubProcess.exitValue(Runtime.java:357)
	at org.apache.harmony.jpda.tests.jdwp.share.JDWPUnitDebuggeeProcessWrapper.WaitForProcessExit(JDWPUnitDebuggeeProcessWrapper.java:279)
	at org.apache.harmony.jpda.tests.jdwp.share.JDWPUnitDebuggeeProcessWrapper.finishProcessAndRedirectors(JDWPUnitDebuggeeProcessWrapper.java:87)
	... 14 more

***********************************************************
Modifications since last successful build:	(1)
            
add cc-hdk log20080529010412Lbuild.640 05/29/2008 01:04:12hdk

begin 644 execution_log.zip
M4$L#! H    ( .B5Q#A[BZ":K P  $Q*   2    97AE8W5T:6]N7VQO9RYH
M=&ULW5QM;]LX$O[L /D/Q *'38&(L?P>GQL@E[3;=IMM$6=['YH@8"3:5B*)
M6E)*XNWUO]\,*3F6[-A.E^GVSMA-98J<&<[+,T.*\F"21N'!X$KXTX-!(OG!
M@!&53D/^\N>1B%-'!7_R/NG5__'/GP^VM[+$9REWU&W<W][:WG(43[/$N?9O
M4B%"Y=PITYQWJ[;+#(<=9TD8>'#?)XD4U]Q+2<PB3H*8!%$B9$K)Q[S]3"3.
M>W[+0^R9<)E.B<]'01RD@8B5N08RHT"J%,<?]<\]#_YS/!%%(CY7G@R25)WG
MHP.NZ'T4$A;[A(T9,EP<<Y4%H7_N3;AW(S(8._%OSN^$O GB\64QH?.(W? *
M59Q@RE4*,R3X^<R]B;@@6R\W_&R=P6!@0@HFY"J(F43JE&Y.!<7P0LYB!X51
M#LPAR5*M?D\D4^=:<F<4A-Q8Q)M$PJ^VY=WZQ8P<Z).9NWIBT8T?R MR)+DV
M(GSI?YL632=D<2DY6O[Y&"B<C/YJ]%*QTI&(DB!$[;_[>'Q(\A'/)LRY%S*E
M.++X/)G2:W;+O'DA&EV7*)%)CQ-M%Y**9^(Y#&)D N-(H,B(A8KODF <"XER
M1#P2<GK"[H,HBX: ! 0"'IT4M0E@D3#P''[OA9G/*QK5>LQOD3" N'C2#+2P
M87!U[O,D%-.\;S$O>@T 0W/J.;(LM>MI%L?+K%K<)^287V7C,9?DW:>3EYM(
MF#(YYJF^O,;_)=^#0-U#?3Y"F]NC_?DZ _![F)>08\H2!E3HA$D@.S6JT5.E
MU_Y=0C\%,LU8> *= "SI)RX5@">"39DDMBB"$$W<7?*:!6$F(>9)?9>\DE)(
M<WD6 %+SD"6*^]"Q3IL=\ GOKY/JTOW.OAU2/=IH6Q.JU[(E5+W;LR95NVE-
MJE;7%BFWMWJ"S4U)-5K4;;DK:34V=M&.S2G6.PUKVEH]P<V5U:3=^FHG;6U*
MJ]VA^_9T94_MC::E@.[17L,2RG1I>W^UVCL;J]VE37<UK<W]O4U[KB5TZ-+>
M_FHO?8+B6[;@':3J6DHZB%G6G+2Y1E<;1V'3I6W77EJMVR/5L(1^5DGUK)4-
M]8ZUM-I8 \E_1UW4I5U;Z/[MR. N %:O0WO-98I_-3S;I,#]<(5[!:=\Q"6'
MQ0P]#A2["OF1"$-HSVM=\OKP[?M7QS\4)EJL+M=+]82"R58,=%UKCKO?M%8[
M]_ZOX=!BV675/6WBO34#]MKV2A)[-9>UQ1U(U; 7-A91KVXO"[D_7@A:5;M%
MJ2PF?YL6M.=7%H'A!Z34[=E3E+U5W;ILL_$V1K,)P?SCU<SK=[6>LBBP%X'6
MO,'BJL?BPMPN+MA+\^LPM+VQN^_3EL5*M&=MP[O7LA>$MK($+J<M^:AK<4/$
MM3A%UZ+'HUQM:X\MNFU;"\LVT+*VFVAOP=2Q];2H1YOV@F?-KM:3M+X&M)[R
M+,7:4XL.;=GR4:N@97.+S):[6UU>=COV<K0MM3?MJ;U#+2F] T6DO=6S1>2S
MMQ5F\=% MV=Q(6ZO'GT\;);M!W_[J8HW(O1?W?(X598.5KC4[5K2: =*S;8E
M]]NWMX;9ITU;CV*!E*WXVJ?U-4]U_XY=:S"AV[4D%NK=DEBH=TL(TD%:ME( 
M:*MM;8HM>V=MK&WF=3"CY-K:WDI%YDV<43Y2G^3L/[1S362NE<].=/;7'^,;
M'IX,G_$<GV*1FCO(AWP]$7L,]/*; +:!.1)K#D'BL=U8D!@FP'V2\OMTE_@"
M[\<BG>2G$N6:DX!F0KI'N0,VT6L)D"\B_HVG]198XF'>V1$^XMR:PW???.SX
MD0.SP/">>Q?D4.<L\L;D+/*>93%\EZ1/=KP7Y$@D4QF,)REQ]_?!U1KU>H^<
M0?]\V%",TCOP!/):9+'/\,DI9$(2@'>&@<=C!6ZT2QC8(=$'N*]"3LO\]22+
M.?[DTC:M_T3*7<#;'!8F$P9"@=4(S#X)><J1$UX#6Z!;'J-N8_*2R$['K3=A
MK;)SPJ8$4@?*_V*7_#N(?7&G]GC4::5[D;KUB-NJ0\CX>/J2:)65Z4W2-.GO
M[16I/<_TD/17F\][=ON]\L(  IR\0SV:T\!@O3KM=L%<3=JD,*L'*[[]UPE\
MDPDJHJ[-V:7D, R)O@V0PA67M]RGJZ<U>:[9O/OMK:/?)" 3SGR8B(GB,8^Y
M9*F0%><I?_M=L3'O+ZO$\@/ *#D]P3/\GT6B7P>X( .--OIM G6PBOIL2+F9
M$.=*B%13 4^<D '^/=!!,@Z@O".Z]2X )5]Q].6$QSYBD:@26OY)@9#/1RP+
MP?.UK$API2) I@5Y\/.(3!";WT,D009HS8,2*?0])&=>.9B))+D?2.XA9@?Q
M4\12"?>"4:!?\%C F@61?#(P?(2<SN0J1"IY8"&8EQ_I!Q\JL=M,PADS<C<)
MO,DBU1% )QZJC[G'E6)RNFX&00R1467S5C?F9_?G7$\@46##LE1$@)H>"\.U
M' "_K@0 3-5L@)]8@>@$B0@ "YEU\I9B;9Z:+A*(&&F=CC*0BOP!*R5CR+E!
MFVE987&B]7DU)0QLQ+RJ)YQR!<X+U=-JG/.%]VQ(!^2/D;S2.2W E(8Z!*FG
M/%TE%J23,=KWV0230\-@PL.$+H/8VH,07W)4_$K>'9[J@I& W5C%4G,#T)^"
MT73)P%6>DX^JP8?D!,"P2-''\61QO'/#IPI"C9-!<76ID;!&0N'EE8IQN.)^
MA8!N2Z?)/ 7\"A1TZP:C$_3<>?Y*@3E\H#"3KFA;E'XV>&Y<#:(XN 7?1@*S
ML60'@,,/1B,H-<A(BF@9SQ=5 ;7VP# &EB\QP)"!?J\NG]MJ#<-=;?#EX^GP
MM:Z^Z3'4SAI$%TVJ@:6F9R5N U@L,-_7[^FQ,,\("RQ#B)'R$)@RORL2"'Q+
MA%*+!:'C<0D%CO8@/U!)" 4A-@'&X'N%BNQD(,M= 'FQ<%&4OI"RJKU4,3(X
M&QY>_G[Z_@!IEIP*%E[@ "Q*$&HG0@;I='$\<C<T\.I2A\V\9^B&PA+0;5[<
M"C70Q?V4#"8"8AI4"%6<.OC2'V!P'WS5JH+;NK*#J(9.).^DIXB]=@FG8VHZ
M4M.1 J;TW4:SM8R7"0O\.[/[?$R4&.Z\.3O[B+7Z\,/1K\.J(G,S2H/R)D,@
MN0?41Z*>G":I&$N60-[4A&%U4;B ?(2D'CPHY"M:-<UJM*GE8CQ)"GPCCD0L
M9F-,B8_ P@.GLG0/>+!"3 @X6W)B5C#>CC'.4MP%>)Q;6=;9B)7"HK?:EW8^
M9%<PG!=X?LQ*B2/?OKP1EG%C*)>#<6G[H,JQK.'RJ$>$7B@-P(<PPQ,'$_=S
ME0?E;[_F+#-=%Y3O%>)\<0;('Z#&8,77^193!6#;P%Q>WK(P@TZ44N*\&V 5
M5G1:*4@L[F*24U4526K:-R3_HU;[Q:PD><DIX$XVVX*?&X2*\F18JQWA53E=
M2'Y;(#X@?9I5*Q[0>0SHE\)@<_$0XJD W!7IQ#@+%.+5H3['[0W(*J<\$K><
M0,J#)8-.[,MAI>;P>S05#'FE+TK30WXZ R,(J]07U;1:<V"!#91A^)##6D3+
MBIU-D1'(8@$.LZV.1%^#<6<3*&2UWQ6^*TP!24!!K#!,=;!Y=Q^&O]47V'%.
M[AUO FOU%TB)D:/A*>@\":=5&B"C%XH8U#7[D0#HCI)KM2WIKDLB'ZW*XG&Y
MDJKVAFHK3CUMQH]XB;HT&JS(JHVS6"/5',7#D2$P<SVH7*$Q+\!*5#1DS'8P
M0; %:D55699_52E9>ZB=/Q65\SQ/K>15H?4&K;@JP W>?*E$>66;"LJ+?JTR
MQ'C=([P7X"V+82%WTZC7GPO:\OTC\L#HLP/0@TCT'^(X!H5>:GRZP,9[BOT^
MT_&?%P1?CJ_4(3NOL1Y PP2QB7,8OHMKYCD.CM;$BV6;[)O\\L#9AP_OA[.=
MZ:6_"]#^7_]5 #/'9WN<8/Y^S\<)9:/-=;#W.&&#I],/L\_2 *_T@VI(Z$,$
MD_<"-[^&#+!CY=/IS<\!N=_\&NW"ZU_UU0_HR0XNP$!'+_[ZDRY3!#C@U@Z/
MDG1J&O.MM%D3"F*2]@4YQG]1YV[N,SHUV,(K#)8R[^TMW#!S3 ?X;C1BOH)>
M)(L5HH]>E/9)UVVTHXK;X;8P,B%F$(:O-80]QY\*.@]BG]]3O$1Y%:R(TP>!
MM[<@#\Q_-2K7EI!FGVY[:PN%1%S-=,F5&UKG2[UG*'!#$K4.@<PU4/?UD+D;
M:&DB/"^3$F+W;H(%44X1;J=8P !@HMFK4V<^@XI?JAEH:.&*9OPAGWZCU2?6
M^&VN:LW;[=2_-W/]6T8/"4J+L=_44D"^N\,_VJ-,>%$PZF"/'0SV](]%[9D?
MCMK3OR+U7U!+ 0(4 PH    ( .B5Q#A[BZ":K P  $Q*   2            
M  "D@0    !E>&5C=71I;VY?;&]G+FAT;6Q02P4&      $  0!     W P 
#     
end


Mime
View raw message