harmony-alerts mailing list archives

Site index · List index
Message view « Date » · « Thread »
Top « Date » · « Thread »
From nom...@intel.com
Subject [build-test alert] FAILED Windows 2003 x86: jdktools-test debug
Date Wed, 04 Jun 2008 05:15:21 GMT

BUILD FAILED:
	Ant Error Message:
D:\cc\cc-common\scripts\cc-exec-adaptor.xml:104: The following error occurred while executing
this line: D:\cc\cc-common\adaptors\jdktools-test\adaptor.xml:24: The following error occurred
while executing this line: D:\cc\cc-common\build\checkouts\hdk\working_jdktools\build.xml:160:
The following error occurred while executing this line: D:\cc\cc-common\build\checkouts\hdk\working_jdktools\make\build-test.xml:94:
There were test failures.

Date of build:	2008-06-04 11:52:22 +0700
Time to build:	22 minutes 51 seconds
Last changed:	05/28/2008 21:22:31
Last log entry:	hdk

***********************************************************
Errors/Warnings:	(29)
            
Tests FAILED
[cc-ant]: Test Suite 'jdktools-test' execution. Repository updated: ${repository.updated}
[cc-ant]: Check for 'run' failure of hdk = ${hdk.parameters.run.failed}
[cc-ant]: Result: failed.superiors = '${failed.superiors}'
========================================
Testing jdktools binaries...
========================================
Compiling JPDA tests
Since fork is false, ignoring memoryMaximumSize setting
JPDA exclude list: D:\cc\cc-common\build\checkouts\hdk\working_classlib\deploy\build\jdktools.jpda.exclude
Running JPDA tests
Debugger JVM=D:\cc\cc-common\build\checkouts\hdk\target\hdk\jdk\jre/bin/java
Debuggee JVM=D:\cc\cc-common\build\checkouts\hdk\target\hdk\jdk\jre/bin/java
SAMSA exclude list: D:\cc\cc-common\build\checkouts\hdk\working_classlib\deploy\build\jdktools.samsa.exclude
Running SAMSA tests
test.jre.home=D:\cc\cc-common\build\checkouts\hdk\target\hdk\jdk\jre
Run jdk/bin/java -version in D:\cc\cc-common\build\checkouts\hdk\working_jdktools\build\test_report
Run jdk/bin/javac -version in D:\cc\cc-common\build\checkouts\hdk\working_jdktools\build\test_report
Run jdk/bin/javah in D:\cc\cc-common\build\checkouts\hdk\working_jdktools\build\test_report
Run jdk/bin/javadoc in D:\cc\cc-common\build\checkouts\hdk\working_jdktools\build\test_report
Run jdk/bin/jarsigner in D:\cc\cc-common\build\checkouts\hdk\working_jdktools\build\test_report
Run jdk/bin/keytool -help in D:\cc\cc-common\build\checkouts\hdk\working_jdktools\build\test_report
Run jdk/bin/unpack200 in D:\cc\cc-common\build\checkouts\hdk\working_jdktools\build\test_report
Compiling TOOLS tests
Since fork is false, ignoring memoryMaximumSize setting
TOOLS exclude list: D:\cc\cc-common\build\checkouts\hdk\working_classlib\deploy\build\jdktools.tools.exclude
Running TOOLS tests
test.jre.home=D:\cc\cc-common\build\checkouts\hdk\target\hdk\jdk\jre
The test report is in D:\cc\cc-common\build\checkouts\hdk\working_jdktools\build\test_report\html\index.html
The execution FAILED with the following exception:
The following error occurred while executing this line:
D:\cc\cc-common\adaptors\jdktools-test\adaptor.xml:24: The following error occurred while
executing this line:
D:\cc\cc-common\build\checkouts\hdk\working_jdktools\build.xml:160: The following error occurred
while executing this line:
D:\cc\cc-common\build\checkouts\hdk\working_jdktools\make\build-test.xml:94: There were test
failures.

***********************************************************
Unit Tests: (158)
        
error: org.apache.harmony.tools.keytool.tests.GenKeyTest vmcrash.CrashedTests
Unit Test Error Details:	(1)
                
Test: org.apache.harmony.tools.keytool.tests.GenKeyTestClass: vmcrash.CrashedTests

***********************************************************
Modifications since last successful build:	(1)
            
add cc-hdk log20080528212231Lbuild.752 05/28/2008 21:22:31hdk

begin 644 execution_log.zip
M4$L#! H    ( .AAQ#C40*ZH10P  'M)   2    97AE8W5T:6]N7VQO9RYH
M=&ULU5Q;;]LX%GYV@/P'8H#%I$"D6([CV[H!LDV[;:>9*>I,]Z$) D:B;2:2
MJ"$E)Y[N_/<]AY1L2W9LI\.T66,FE2F>"\_EXR%%N3].H_"X?RV"Z7$_D>RX
M3XE*IR%[^?-0Q*FC^)^L1SKU?_SSY^/=G2P):,H<-8E[NSN[.XYB:98X-\%M
M*D2HG#MEFO-NU7:9(=EIEH3<A_L!2:2X87Y*8AHQPF/"HT3(U"4?\_9SD3@?
MV(2%V#-A,IV2@ UYS%,N8F6N@<V02Y4B_6GOPO?A/\<7423B"^5+GJ3J(J?F
M3+GW44AH'! ZHBAPF>8ZXV%PX8^9?RLRH!T'MQ=W0M[R>'15#.@BHK>LPA4'
MF#*5P@@)?KXP?RPNR<[++3\[YT ,0D@AA%SSF$KD[KK;<T$U_)#1V$%EE -C
M2+)4F]\7R=2YD<P9\I 9C_CC2 35MKQ;KQB1 WTR<U</++H-N+PDKR333H0O
MO6^SHNF$(JXD0\\_G0"%@]%?C5TJ7GHEHH2':/WW'T]/2$[Q9,I<^"%5BJ&(
M+^.I>T,GU%]4HM'VB!*9]!G1?B&I>"*9 QZC$* C7)$A#17;)WP4"XEZ1"P2
M<GI&[WF410-  @()CT&*U@2P2"A$#KOWPRQ@%8MJ.^:W2,@A+QXU JULR*\O
M I:$8IKW+<;EW@# N#GW'%E6^O53%L>KO%K<)^2476>C$9/D_>>SE]MHF%(Y
M8JF^O,'_)3N 1#U >S[ F]GC_>4F _";CTO(D4L3"ES<,97 =FI,HX?JW@1W
MB?N9RS2CX1ET K!T/S.I #P1;,HLL441A&CB[9,WE(>9A)PG]7WR6DHAS>4Y
M!Z1F(4T4"WJDY;8Z;8@)_^^S:KK=5M<.JR.WWK2H5<>:5FU+K$"K>LN:5H>>
M+59>>SVKPVU9><"KOCX:&EOSJF_D]1C#'QU:,WRW:<E:S8UIV-R6UV'3/?0:
MUJS5L,3JR&UXUM"A:0]H#AOK4[JUM=T]]V@#:&T=\5VW<V0OX.TAC36[-]U.
MUQIH-3QK +\I1K?.0J_KMNN6@,;BQ-JT&ECVM+(&RL"J:S%&GZ&I.I:R&90Z
MM%1C 3#88F41KH!5Y^A[.?"'%#-6 =EF-MLJ&NRRLECX><\O":W"E<4<;%B:
MYVV.SUKQ81=CZL]O)0ZV:JY?Y/RHL+*'"_:TZFQ83/R8BJC3MA:B-ED]PQ6.
M70RU5EW56^MC8>M]AH8E[]EBLW%DCUFZM9YC$-C:>[0+GL\3AS<@WM'646X7
M7.R-T")Z6MS4;MO:/O$LJN59G &15\=2$>-9W6[?%*:/V3!L6D-2KV/O@8EG
M;:KP;$U>FR/K,6;?L))X!*M--?OV3Q/:;NOH.=:TG;:UI<0SK1YM ;S%S&FX
M7M/::M?F<[AGN$FT^:'E#UHK6=ROL%C.K-H9^/9S#6]%&+R>L#A5=HXV=-VF
MK0JBU;:W3]>VMSG3L8<2;;?=M39 BSAO;7L-7-AI6@I],):M9]EMNR,\LC17
M8\#;VK@%M6R=1SBR!U^M^3)_=R<5F3]VACFA/DG9F[<SS6.AE<U.5/8V'Z,;
MG)P-GO <G:*16CA(AW)]$?L4S/*K +'<'$DUAQ#QV&PL2 P#8 %)V7VZ3P*!
M]V.1CO-3@7+#23PS(-VCW &;W!L)@"\B]HVGY99$XF':V1$ZXDS,X;=O/O;[
MP(%5$'C/_$MRHF<L\M;,6.0#S6+X+DF/[/DOR"N13"4?C5/B=;L0:8UZO4/.
MH7].-A##] XB@;P161Q0/.(,\R#A$)PA]UFL((SV"04_)/H ]77(W+)\/<AB
MC#]Y+M2!/Y%R%X@VAX;)F()2X#4"HT]"EC*4A-<@%OB6:=0D)B^);+7JW:/N
M/MD[HU,"93WJ_V*?_(?'@;A3!YP>-@XB-?&)=^A!P@1X^)%HBY79C=,TZ1T<
M%/-Z/LW#C+_>>_Z3N^^U'W)(;_(>S6@.XX+SZFZ[#=XZ= ]=&-7<B>_^=0;?
M9()VJ&MOMEUR$H9$WP9 88K)"0O<]<,:/]5HWO_ZSM$'^<F8T0 &8I)XQ&(F
M:2ID)7;*WWY7=,1ZJ\JP_/PM:NZ>X1'Z+R+1I_$O25^#C3[,KX[7<9^1E)L)
M<:Z%2#47",0QZ>/?8YTC(PZU'=&M=QR,?,TPE!,6!PA%HLIH]2<%1@$;TBR$
MP->Z(L.UA@"=EO3!SP,Z06I^#Y4$Z:,WCTNL,/:0G3GQ/U-)LH!+YB-D\_@Q
M:JF$^7S(]?L52U"SI%) ^D:.D-.97H5*I0@L%//S$_400R5QVVDX$T;NQMP?
M+W,= G+BF?:8^4PI*J>;1L!CR(RJF'>Z,3\ZOQ!Z IF"&)JE(@+0]&D8;I0 
M^'4M &"J;@/XQ/I#SX^( +"*V:1O*=<6N>D:@8BAMNDP ZW('[!,,HY<(-K.
MR@IK$VW/ZRFAX"/J5R/A$U,0O% [K<>Y0/A/AG3 _A39*SVE<9S1T(:@]92E
MZ]2"Z62$_GTRQ>3 "!BS,'%706QMKL37'!7_(N]//NEZD8#?:,53"P083WPX
M74&X+G)RJAI\2,X '(L< Z0GR_3.+9LJ2#5&^L75E4;"&@F%GQ<J)N"*^Q4&
MNBV=)HL<\"MPT*U;4"<8N8ORE0)W!,!AIEW1MJS]C'B!K@99S"<0V\A@1DOV
M #@"/AQ"J4&&4D2K9+ZH*JBM!XXQL'R%"88"]&MM^=C66QCN:H>OIG<';W3Q
M[9Y"Z:Q!=-FE&EAJ>E1BPF&M0(- OR9'PWQ&6!(90HZ426#([*Z80.!;(I1:
MK@<=GTDH<'0$!5PE(=2#V 08@Z_U*;*7@2YW'.;%(D11^T++JO5214G_?'!R
M]?NG#\?(LQ14L.R" *!1@E [%I*GTV5ZE&YXX-653IO%R- -A2>@VZ*Z%6Y@
MB_LIZ8\%Y#28$*HX=?RUU\?D/OY+FPINZ\H.LAHZD;R3'B+VVB?,';FFHVLZ
MNH I/:]QV%PERZ0%_IWY?3$G2@+WWIZ??\12??#;JU\&54/F;I0&Y<T,@>SF
MJ(],?3E-4C&2-(%Y4S.&Q441 O(!EIJX7^A7M&J>U6Q3J]5XE!;X0AJ):$Q'
M."4^  MS267MYGBP1DU(.%MZXJQ@HAUSG*:X"?"PM+*N,XJURF*TVM=V,677
M"%Q4>)%FK<918%_?",NX$93+?%3:/:A*+%NX3/6 TDNE <00SO#$P8G[J<J#
M\K=?<I&9K@O*]PIUOCI]E ]08[#BK\464P5@6]]<7DUHF$$GUW6)\[Z/55C1
M::TBL;B+2<Y5532IZ=B0[(]:[=]F)<E*00%WLMG^^P(1&LJ78:WV"J_*TX5D
MDP+Q >G3K%KQ@,UC0+\4B,W%/,53 ;@KTK$)%BC$JZ0!P]T-F%4^L4A,&($I
M#Y8,>F)?#2LUA]VCJX#DM;XH#0_EZ1D805BE@:A.JS4'%MC &<@'#-8B6E?L
M;(H,+HL%.(RV2HFQ!G3G8RAD==P5L2M, 4G 0+1P3)78O#H/Y._T!79<T'O/
M'\-:_05RHN35X!/8/ FG51Z@HQ^*&,PU>T<?NJ/FVFPKNNN2*$"OTGA4KJ2J
MO:':BE-?N_$C7J(MC04KNFKG+-=(-4>Q<&@8S$(/*E=HS NP$A<-&;,-3%!L
MB5M159;U7U=*UN:U\^>B<EZ4J8V\+K7>HA?7);C!FZ^5+*]L4T%YT:M52$S4
M/2!["=ZR&!9RMXUZ_:F@+=\_(G-!7QR 'D2B_Q+',2CT4N/3)3;>N]COBSOZ
M\Y+@N^F5.F3O#=8#Z!@>FSP'\GU<,R](<+0E7JS:8]_FQ?_SWW[[,)AM3*]\
M+?_H__VE?#/&)WN:8/Y^SZ<)9:<M=+#W-&&+1]/ST6<IQRO]E!HF] &"R0>!
MFU\#"MBQ]M'TUH=]6NO>('ES\N[#Z].__UC*3-D.!*'#HB2=FL9\XVO6A.+-
M%'M)3O%?M)"7>U@#N2UTP= NR][=P>TMQW2 [\8.YBM80])8(5;H)208S:MW
MHTJ0X"8N"B&&")/-&AY>X._J7/ X8/<N7J*^"M:OZ5SAW1U [<6OQN3:$]+L
MJNWN[*"2B(*9+I",>\WLIG?X!&X?HM4A[9B&U9XF6;B!GB;"]S,I(=/NQEB^
MY!SA=HKE!L ;NKTZ=!I0J,^EFJ6X5JYHQE^]Z36:/6)-WO:FUK*]5OU["]<_
M_#.?3K0:76,"F)WN\(^.J"+M7'!K_X >]P_T;RL=F-]9.M _NO0_4$L! A0#
M"@    @ Z&'$.-1 KJA%#   >TD  !(              *2!     &5X96-U
C=&EO;E]L;V<N:'1M;%!+!08      0 ! $    !U#      ! 
end


Mime
View raw message