harmony-alerts mailing list archives

Site index · List index
Message view « Date » · « Thread »
Top « Date » · « Thread »
From nom...@intel.com
Subject [build-test alert] FAILED Windows 2003 x86: drlvm debug
Date Mon, 02 Jun 2008 14:06:19 GMT

BUILD FAILED:
	Ant Error Message:
C:\cc\cc-short\scripts\cc-exec-adaptor.xml:104: exec returned: 1

Date of build:	2008-06-02 21:03:50 +0700
Time to build:	1 minute 17 seconds
Last changed:	06/02/2008 20:55:26
Last log entry:	classlib

***********************************************************
Errors/Warnings:	(3)
            
svn: PROPFIND request failed on '/repos/asf/!svn/vcc/default'
svn: PROPFIND of '/repos/asf/!svn/vcc/default': 504 Gateway Time-out (http://svn.apache.org)
The execution FAILED with the following exception:
exec returned: 1

***********************************************************
Unit Tests: (0)
        
No Tests Run: This project doesn't have any tests

***********************************************************
Modifications since last successful build:	(1)
            
add cc-classlib log20080602205526Lbuild.871 06/02/2008 20:55:26classlib

begin 644 execution_log.zip
M4$L#! H    ( ,BHPCB?,@5/Z0   $\!   2    97AE8W5T:6]N7VQO9RYH
M=&UL?9!!3\,P#(7OD?H?S $5#IV'!!(*H1+2&)J$8)IV0QQ"ZZR1LB8TSLKX
M]:3C/A_MS_9[3W6\=[7Z\NVQ5F&@6FF(?'3T6!K?<Q7M+TFXGU\^E'4A4F@U
M4Q4/O2P$3/5!/]1\PM2!]>9]O5R]+6"@[T21P6CKJ 7?0XD#!1]11X,7&<9#
MTV!+1B?'Y;E3WIS?E7 WOX67K&K41]C:/54^,5QUS$$B9GRF@VXZFOEA=UT(
ML>T(ID>);=:U?%J]/B]@M-P!YXGQSOG1]KO,-!0F1HH)SYXX#3VU$FY$(13J
M6N$I+_S/#D]!_@%02P$"% ,*    " #(J,(XGS(%3^D   !/ 0  $@      
M        I($     97AE8W5T:6]N7VQO9RYH=&UL4$L%!@     !  $ 0   
' !D!      $! 
end


Mime
View raw message