harmony-alerts mailing list archives

Site index · List index
Message view « Date » · « Thread »
Top « Date » · « Thread »
From nom...@intel.com
Subject [build-test alert] FAILED Linux x86_64: drlvm-reg-test debug
Date Thu, 22 May 2008 12:43:32 GMT

BUILD FAILED:
	Ant Error Message:
/export/users/cc/cc-common/scripts/cc-exec-adaptor.xml:104: The following error occurred while
executing this line: /export/users/cc/cc-common/adaptors/drlvm-reg-test/adaptor.xml:67: There
were drlvm-reg-test failures

Date of build:	2008-05-22 19:43:15 +0700
Time to build:	11 seconds
Last changed:	05/22/2008 18:34:39
Last log entry:	hdk

***********************************************************
Errors/Warnings:	(8)
            
BUILD FAILED
/export/users/cc/cc-common/build/checkouts/hdk/working_vm/build.xml:352: The following error
occurred while executing this line:
/export/users/cc/cc-common/build/checkouts/hdk/working_vm/make/tests/reg-test.xml:83: The
following error occurred while executing this line:
/export/users/cc/cc-common/build/checkouts/hdk/working_vm/make/build-java.xml:30: Compile
failed; see the compiler error output for details.
Total time: 8 seconds
Warning: skipping zip archive /export/users/cc/cc-common/build/results/drlvm-reg-test_20080522_1943.zip
because no files were included.
The execution FAILED with the following exception:
The following error occurred while executing this line:
/export/users/cc/cc-common/adaptors/drlvm-reg-test/adaptor.xml:67: There were drlvm-reg-test
failures

***********************************************************
Unit Tests: (0)
        
No Tests Run: This project doesn't have any tests

***********************************************************
Modifications since last successful build:	(2)
            
add cc-hdk log20080522183439Lbuild.823 05/22/2008 18:34:39hdk
add cc-hdk log20080522183439Lbuild.823 05/22/2008 18:34:39hdk

begin 644 execution_log.zip
M4$L#! H    ( &Z=MCB"\EB+,@,  -X)   2    97AE8W5T:6]N7VQO9RYH
M=&ULS5;;;A,Q$'TF7S$OB%9BUTEZ(6Q#)* @0$5(;1$/51LY]C3KQKM>^9*D
M?#UC)RU-T8*@2!!%R=H^GCUG;O:P])4>#2=&7H^&C<71D(/SUQI?/+DTM<^<
M^HH%#+J/#YZ,.J&1W&/FYG71Z62K$3W90&, .).HT>,Y',9_54^AU]N#2Z71
MP:4U%3!<-L9Z%AQ:QX2@;R9,59F:38+2DEET07O'I-7S*K,XS3PZ'VV3]2L^
MY^?P*@*CS0+2GGQ9Z0W QH!,Y-%$T0[)&AVFJLXXJ14DV:K))GKUC*(TY_"Z
M1#&+RBZ-_;4<$=$FD*!2SMAJ:4P:3; "224V6$O'KCAMO_/ZK)=W)_V[,SE!
MVA60X88<<NLOEU$@&V[Q1QUGU4PJ2SHL4NPDT*#X71T+8Z,+QO-JO:Q5'9;C
MY6!_O+\[G@HQEC@)4Y:HL)L(D&'-G4/W7W&JN5=S_!W77OTDE7ZUE>;OA>2L
MO,[CHR#Y";^JFAZL<F1=/-[\TQC=(7FBZLB*K(.BHN;:X5-0T]K82+S"RMCK
MCWRIJE"=4.< ASXV@E9[V>VG%=++X<WQ\:=C4/4#O."L2&*C5JI IVC+N[W=
M09<=&>/P(_?E*2VGE[92@2WN@3R)%*+][5;8(VG"1",$W< +XH_9\P-@++XC
MI[FM$RIIX=/0\WI+;F\?M-M:M1^XN+AHQ1R&1BM!M0/:"*YASJWB:P(/\CPT
MUI"="K9Z@-8:N]V>[J\^OS\ZA+<OWQ^].=Q8>&#FQOY>[.SU"S@M8^9I;18Q
MUQ(?,$($:ZEI+$JJ%, EBI!.'E]2?L90%7^)3,5G^+U<4D4G:H.=_X)9PJ0.
MLW)8MU@W%&+&Z5<>4"TBO1QO&I.](1I\$WPZT"1ZPKJ\/<JGQE.">57%2P%9
MI/-);G:+#_0+Q^D<+Z#769^>7U5S#E^XK8ES 6ZFFB;Z@J:!6U%2#_[3R\&X
MW^T.NGO]_KCW?'<GCQ8G*#A9@=JL^^<"+5+[$#I(E'FG$^.U#HBIUSD+"^7+
MY)\[D5P*;"*FZ/QIB'^BBDO>>&/O"[J93W'<?Y:RB^@G#9O(%-E ;ND,&1\-
M6;J^L=55CJ5[W3=02P$"% ,*    " !NG;8X@O)8BS(#  #>"0  $@      
M        I($     97AE8W5T:6]N7VQO9RYH=&UL4$L%!@     !  $ 0   
' &(#      $! 
end


Mime
View raw message