harmony-alerts mailing list archives

Site index · List index
Message view « Date » · « Thread »
Top « Date » · « Thread »
From nom...@intel.com
Subject [build-test alert] FAILED Windows 2003 x86_64: drlvm-reg-test debug
Date Thu, 22 May 2008 08:20:54 GMT

BUILD FAILED:
	Ant Error Message:
C:\cc\cc-common\scripts\cc-exec-adaptor.xml:104: The following error occurred while executing
this line: C:\cc\cc-common\adaptors\drlvm-reg-test\adaptor.xml:67: There were drlvm-reg-test
failures

Date of build:	2008-05-22 15:20:24 +0700
Time to build:	23 seconds
Last changed:	05/22/2008 13:38:13
Last log entry:	hdk

***********************************************************
Errors/Warnings:	(8)
            
BUILD FAILED
C:\cc\cc-common\build\checkouts\hdk\working_vm\build.xml:352: The following error occurred
while executing this line:
C:\cc\cc-common\build\checkouts\hdk\working_vm\make\tests\reg-test.xml:83: The following error
occurred while executing this line:
C:\cc\cc-common\build\checkouts\hdk\working_vm\make\build-java.xml:30: Compile failed; see
the compiler error output for details.
Total time: 14 seconds
Warning: skipping zip archive C:\cc\cc-common\build\results\drlvm-reg-test_20080522_1520.zip
because no files were included.
The execution FAILED with the following exception:
The following error occurred while executing this line:
C:\cc\cc-common\adaptors\drlvm-reg-test\adaptor.xml:67: There were drlvm-reg-test failures

***********************************************************
Unit Tests: (0)
        
No Tests Run: This project doesn't have any tests

***********************************************************
Modifications since last successful build:	(2)
            
add cc-hdk log20080522133813Lbuild.628 05/22/2008 13:38:13hdk
add cc-hdk log20080522133813Lbuild.628 05/22/2008 13:38:13hdk

begin 644 execution_log.zip
M4$L#! H    ( )EZMCA?L17=. ,  )L)   2    97AE8W5T:6]N7VQO9RYH
M=&ULS5;;3ALQ$'UN)/YA7BI ZFXN)31=0J2VM&HK4"6@Z@,+D6,/61/O>N5+
M$OKU'3N! FJB4AYH%"6[]O'XG+G9_<*5:M ?:7$]Z-<&!WT&UETKW-^\U)5+
MK/R)&?1:+_<V!QL-7POF,+'3*MMH;#22Q7M\-CZ, <"90(4.S^$@_,MJ#.UV
M%RZE0@N71I?P(<LYIV_"=5GJ*A]YJ41NT'KE;"Z,FI:)P7'BT+IHD6Q>L2D[
MA_<!&2QE$!>E\U+=1]Q_(RMIL)*M R6U\F-9)8S4<I)LY.@!?O&,O-#G\*% 
M/@FB+K59H80'B/:DI1"3?#$U)'G:&XXD$&NLA&U>,6.;=S9-VFEKU+D[DA)D
M'7,R79,S;IUE$PI@S0S^@?]9.1'2$'^#%#$!])+]%?^9-D'O<%HNIV>R$GIF
MA_/>[G!W9UC:*1\*'/EQ'CGD-TZW.5?,6K3_!YF*.3G%Q[GS:FWB_ %/XVN7
MP%EQG89'3N+C\D5]M&&1'<LR<?IY0G.'W8FL AW: 235+5,67X$<5]H$QB66
MVEP?L;DL?7E"+0(LNE#KJPTFMY_5F'8*'X^/OQV#K![K &MX%!DT4JU924L^
M=W=ZK?Q0:XM'S!6G-!UW6DT MI@#B@E23':W5^->".U'"L&K&O:)-B9O]Z#9
M#+ND-+9U0N7+77QUK-H2V]M[:XPM&@Q<7%RL!AWX6DE.U0)*<Z9@RHQD2PI/
M=#K41I.E$K;:@,9HL[TNA=]__W)X )_>?3G\>'!_YE]2-G3P['6WD\%I$=)-
M*3T+"19Y@.;<&T,-8E9070#.D?MXHKB"DC+$*7L2A9)-\'=IQ"*.A'JOGY%/
MQ,16LG!.*UNV"N+#Z%?L4;$A;8DW'<C<T/.N]BZ>3 (=86VZ+I*GVE$B.5G2
M<=K>(:-T[(@'+>$K_<)Q/)H)M)R#LY^R/H<?S%1$/ ,[D74=W$##P POJ-$^
MZI0?=EJM7JO;Z0S;W4XK#69&R)FW")5>]L09&J2^P)47*$A7(P1H&0%=+1,2
M9M(5T35W0C?G6 =,UOCGF#X4PP2KG38/==R,Q\#MOHE)1*PC]?O(&$I/WJ";
M4[_)!OUFO'LU%_>P9KR4_0)02P$"% ,*    " "9>K8X7[$5W3@#  ";"0  
M$@              I($     97AE8W5T:6]N7VQO9RYH=&UL4$L%!@     !
-  $ 0    &@#      $! 
end


Mime
View raw message