harmony-alerts mailing list archives

Site index · List index
Message view « Date » · « Thread »
Top « Date » · « Thread »
From nom...@intel.com
Subject [build-test alert] FAILED Linux x86: drlvm-reg-test debug
Date Thu, 22 May 2008 07:10:33 GMT

BUILD FAILED:
	Ant Error Message:
/export/users/cc/cc-common/scripts/cc-exec-adaptor.xml:104: The following error occurred while
executing this line: /export/users/cc/cc-common/adaptors/drlvm-reg-test/adaptor.xml:67: There
were drlvm-reg-test failures

Date of build:	2008-05-22 14:10:11 +0700
Time to build:	15 seconds
Last changed:	05/22/2008 13:32:39
Last log entry:	hdk

***********************************************************
Errors/Warnings:	(8)
            
BUILD FAILED
/export/users/cc/cc-common/build/checkouts/hdk/working_vm/build.xml:352: The following error
occurred while executing this line:
/export/users/cc/cc-common/build/checkouts/hdk/working_vm/make/tests/reg-test.xml:83: The
following error occurred while executing this line:
/export/users/cc/cc-common/build/checkouts/hdk/working_vm/make/build-java.xml:30: Compile
failed; see the compiler error output for details.
Total time: 10 seconds
Warning: skipping zip archive /export/users/cc/cc-common/build/results/drlvm-reg-test_20080522_1410.zip
because no files were included.
The execution FAILED with the following exception:
The following error occurred while executing this line:
/export/users/cc/cc-common/adaptors/drlvm-reg-test/adaptor.xml:67: There were drlvm-reg-test
failures

***********************************************************
Unit Tests: (0)
        
No Tests Run: This project doesn't have any tests

***********************************************************
Modifications since last successful build:	(2)
            
add cc-hdk log20080522133239Lbuild.862 05/22/2008 13:32:39hdk
add cc-hdk log20080522133239Lbuild.862 05/22/2008 13:32:39hdk

begin 644 execution_log.zip
M4$L#! H    ( $YQMCC"<7MK,@,  -8)   2    97AE8W5T:6]N7VQO9RYH
M=&ULS59=;Q,Y%'W>_(K[@FBEG?%,H"4[#9%@RVI9%2&U13Q4;>38MQDWGO'(
M'TG*K^?:2:$!#0BZ$D11,K:/[YQSO^QQ[1L]&<^,O)V,.XN3,0?G;S4^?WQM
M6I\Y]0$K&!6/CAY/!J&3W&/FEFTU&&2;$3W90&, N)"HT>,E',=_U<ZA+$=P
MK30ZN+:F 8;KSEC/@D/KF!#TS81I&M.R65!:,HLN:.^8M'K99!;GF4?GHVVR
M?L.7_!)>1F"T64':DZ\;O0/8&9")/)JH^B%9I\-<M1DGM8(D6S7;16^>4=3F
M$OZN42RBLFMCOR]'1+0))*B6"[99FI)&$ZQ 4HD=MM*Q&T[;[[T^*_-B-KP_
MDQ.D7P$9[L@AG_SE,@IDQRU^K>.B64AE28=%BIT$&E0_JF-E;'3!=-ELE[5J
MPWJZ'AU.YT),)<["G"4>[,[]9%5SY]#]/H1:[M42?\2I-]](HN]MI?DO@G%1
MW^;Q49#VA-_42PF;[-B6C3>_+CKW&)ZI-E(BTZ"HEKEV^">H>6ML9-U@8^SM
M&[Y636C.J&& 0Q_KO]=>]NG3"RES>'5Z^O845/L %S@KDMBHE0K/*=KR[\'3
M4<%.C''XAOOZG);32WNIP![W0&Y$BL_A?B_L#VG"3",$W<%SXH_97T? 6'Q'
M3G-[9U3)PJ>AY^V>W-\_ZK>UZ3IP=775BSD.G5:"J@:T$5S#DEO%MP0>Y'GH
MK"$[#>R5@-8:N]^?ZR_?O3XYAG]>O#YY=;RS\,"TC6V]>G(PK."\CIFGM5G%
M7$M\P @1K*5VL:JI3 #7*$(Z<'Q-^1E#5?U/9!J^P,_EDLHY41L]^2V8)4QJ
M+QN'%=6VFQ S3K_RB&H1Z>5XUY7L'='@N^#3.2;1$];E_5$^-YX2S*N&3MVR
M()-T+LG==O$?_<)I.K\),]B>FA]4=PGON6V)= 5NH;HN.H.F@5M14P?^V4O!
M=%@4H^)@.)R63\LBCQ9G*#A9@=9LN^<*+5+_$#I(E/E@$ .VC8AIMTD+*^7K
MY*![H5P+["*F&OQLC+^ABDO>>6._%'0WGP)Y^"RE%]%/&G:1*;2!W#(8,SX9
MLW1M8YLK'$OWN8]02P$"% ,*    " !.<;8XPG%[:S(#  #6"0  $@      
M        I($     97AE8W5T:6]N7VQO9RYH=&UL4$L%!@     !  $ 0   
' &(#      $! 
end


Mime
View raw message