harmony-alerts mailing list archives

Site index · List index
Message view « Date » · « Thread »
Top « Date » · « Thread »
From nom...@intel.com
Subject [build-test alert] FAILED Linux x86: jdktools-test debug
Date Tue, 22 Apr 2008 22:02:11 GMT

BUILD FAILED:
	Ant Error Message:
/export/users/cc/cc-common/scripts/cc-exec-adaptor.xml:104: The following error occurred while
executing this line: /export/users/cc/cc-common/adaptors/jdktools-test/adaptor.xml:24: The
following error occurred while executing this line: /export/users/cc/cc-common/build/checkouts/hdk/working_jdktools/build.xml:160:
The following error occurred while executing this line: /export/users/cc/cc-common/build/checkouts/hdk/working_jdktools/make/build-test.xml:93:
There were test errors.

Date of build:	2008-04-23 04:43:11 +0700
Time to build:	18 minutes 51 seconds
Last changed:	04/23/2008 01:16:56
Last log entry:	hdk

***********************************************************
Errors/Warnings:	(42)
            
Result: 1
========================================
Testing jdktools binaries...
========================================
Compiling JPDA tests
Since fork is false, ignoring memoryMaximumSize setting
----------
1. WARNING in /export/users/cc/cc-common/build/checkouts/hdk/working_jdktools/modules/jpda/src/test/java/org/apache/harmony/jpda/tests/framework/TestOptions.java
(at line 505)
internalProperties.put(name, value);
^^^^^^^^^^^^^^^^^^^^^^^^^^^^^^^^^^^
Type safety: The method put(Object, Object) belongs to the raw type HashMap. References to
generic type HashMap<K,V> should be parameterized
----------
1 problem (1 warning)
JPDA exclude list: /export/users/cc/cc-common/build/checkouts/hdk/working_classlib/deploy/build/jdktools.jpda.exclude
Running JPDA tests
Debugger JVM=/export/users/cc/cc-common/build/checkouts/hdk/target/hdk/jdk/jre/bin/java
Debuggee JVM=/export/users/cc/cc-common/build/checkouts/hdk/target/hdk/jdk/jre/bin/java
SAMSA exclude list: /export/users/cc/cc-common/build/checkouts/hdk/working_classlib/deploy/build/jdktools.samsa.exclude
Running SAMSA tests
test.jre.home=/export/users/cc/cc-common/build/checkouts/hdk/target/hdk/jdk/jre
Run jdk/bin/java -version in /export/users/cc/cc-common/build/checkouts/hdk/working_jdktools/build/test_report
Run jdk/bin/javac -version in /export/users/cc/cc-common/build/checkouts/hdk/working_jdktools/build/test_report
Run jdk/bin/javah in /export/users/cc/cc-common/build/checkouts/hdk/working_jdktools/build/test_report
Run jdk/bin/javadoc in /export/users/cc/cc-common/build/checkouts/hdk/working_jdktools/build/test_report
Run jdk/bin/jarsigner in /export/users/cc/cc-common/build/checkouts/hdk/working_jdktools/build/test_report
Run jdk/bin/keytool -help in /export/users/cc/cc-common/build/checkouts/hdk/working_jdktools/build/test_report
Run jdk/bin/unpack200 in /export/users/cc/cc-common/build/checkouts/hdk/working_jdktools/build/test_report
Compiling TOOLS tests
Since fork is false, ignoring memoryMaximumSize setting
----------
1. WARNING in /export/users/cc/cc-common/build/checkouts/hdk/working_jdktools/modules/tools/src/test/java/org/apache/harmony/tests/tools/javah/Test/Test01.java
(at line 24)
private static final long xxx2 = 1;
^^^^
The field Test01.xxx2 is never read locally
----------
1 problem (1 warning)
TOOLS exclude list: /export/users/cc/cc-common/build/checkouts/hdk/working_classlib/deploy/build/jdktools.tools.exclude
Running TOOLS tests
test.jre.home=/export/users/cc/cc-common/build/checkouts/hdk/target/hdk/jdk/jre
The test report is in /export/users/cc/cc-common/build/checkouts/hdk/working_jdktools/build/test_report/html/index.html
The execution FAILED with the following exception:
The following error occurred while executing this line:
/export/users/cc/cc-common/adaptors/jdktools-test/adaptor.xml:24: The following error occurred
while executing this line:
/export/users/cc/cc-common/build/checkouts/hdk/working_jdktools/build.xml:160: The following
error occurred while executing this line:
/export/users/cc/cc-common/build/checkouts/hdk/working_jdktools/make/build-test.xml:93: There
were test errors.

***********************************************************
Unit Tests: (160)
        
error: testCombinedEvents_04 org.apache.harmony.jpda.tests.jdwp.Events.CombinedEventsTest
Unit Test Error Details:	(1)
                
Test: testCombinedEvents_04Class: org.apache.harmony.jpda.tests.jdwp.Events.CombinedEventsTestorg.apache.harmony.jpda.tests.framework.TestErrorException:
org.apache.harmony.jpda.tests.framework.jdwp.exceptions.TimeoutException: Connection was closed
	at org.apache.harmony.jpda.tests.framework.jdwp.VmMirror.receiveEvent(VmMirror.java:1698)
	at org.apache.harmony.jpda.tests.jdwp.Events.CombinedEventsTest.receiveAndCheckEvents(CombinedEventsTest.java:916)
	at org.apache.harmony.jpda.tests.jdwp.Events.CombinedEventsTest.testCombinedEvents_04(CombinedEventsTest.java:544)
	at java.lang.reflect.VMReflection.invokeMethod(VMReflection.java)
Caused by: org.apache.harmony.jpda.tests.framework.jdwp.exceptions.TimeoutException: Connection
was closed
	at org.apache.harmony.jpda.tests.framework.jdwp.PacketDispatcher.run(PacketDispatcher.java:600)

***********************************************************
Modifications since last successful build:	(1)
            
add cc-hdk log20080423011656Lbuild.840 04/23/2008 01:16:56hdk

begin 644 execution_log.zip
M4$L#! H    ( $(HESAX-G*G" X  .55   2    97AE8W5T:6]N7VQO9RYH
M=&UL[1QI;]LX]K/]*X@!%I, $2WYML<-D.TQ;2=IBSC3_5!D T:B;26RJ*&D
M))Y.__N^1TJV)3N*,V6R"VR-F50'W\%W/XK2:);,@\/1I? 6AZ-(\L,1(W&R
M"/B+GR<B3*S8_Y,/2=_^QR\_'];3R&,)M^*;<%BO6S%/TLBZ\JX3(8+8NHWQ
M8C:D>%6F / JC0+?A9L>B:2XXFY"0C;GQ ^)/X^$3"CYE%T_$Y%US&]X@",C
M+I,%\?C$#_W$%V&LCP'-Q)=Q@O -?H<(&FG,9=QP7?C/<L5\+L)&[$H_2N)&
MALCG,;V;!X2%'F%3AK0KP2]3/_ :[HR[UR(%-#/ONG$KY+4?3B_R.3;F[)J7
M"-3K"8^389W@[PMW9^*<U%_L^*N? 2Q0(#D%<NF'3")J2G?'\@B!OU2S_7YI
M;Q.7OG4A>2Q2Z?)<7 %+)D+.OUL;]Z O:<,-. LMU$EL 6B4@F[JKH@6UI7D
MUL0/.-JI.YL+KW@E&S+4"K7@?JKN*+W.KSU?GI.7DBLIP\GPNXU)#T)B,"?$
M]!RDXA_&LF8L"E(;2]&#8>:1'Z!GOO_TZHAHR3V'>AINP.*89\2NV USU[EI
M]ARB9T24X9)$/#GUL1\B.0 C?DPF+(CY ?&GH9#(T9S/A5R<L#M_GL['D$,(
M9 N,:04<UO)7N.Q0\J^CTP_O/OQJ)#IKEVU<069JQ-)5<VH@J8:0TP:+&"!H
MS)@$C L]2L]Z(L$!$%T#X_''2%DX1< "MV2/)034P$G'[NP7;M7\,.$R9,&G
ME85!Z-E#SSH@-RQ(^?XO18A_/_PK )PM(I MF_!D,21G,PZ23V8"G!C(?+Q$
M?ST@^M]]<LD#$4Z5=20P4K);DB#X6Q;/3EA$R2F?<,E!KVK,E(=<^FYAS.BW
M@\^'))Z)-/  'XD8"@DF"2KV=M(MQHW+@,_)GD-NF0Q!5_OU.E0>@(I;_,X-
M4H\7W4XY6W8') UY]>\:A3+DP+]L>#P*Q"(;FYL*1>73C)"J6K8%@=,T#+>$
M@/PV(:_X93J=<DG>?SYY\4A&$R:G/%&'5_B_Y W(_8VET6U0X4]!Y<M5"@%]
M-57P$ZK]A&9^HD6E9D^OO-N(?O9EDK+@! :!*]#/P >X"SI. 2->B G6@\0Y
M(&^8'Z00C(?$/B"OI112'Y[YD'EXP**8>T/2HYUN&^*'^]V8VK1E=PUA<IR.
M(4SMCBE,O98I3';3#*86[;=-\=3J-:LPM7;%Y#1IOU?)5'-75'W:Z0U,&53/
M"*(>';3,B,FF/:<257M75,TN[3NF',_N&</D](TYGAGEM6FS4VGDW7LP.1N.
M9P.J+=I[/3[;)9R_ON$A'$.)>8GUO#Y%/LB;HW?'KU\9\!RG;RHP- T%]3X=
M=,QX<XL:,BU 9"KU53O@SK[L=&G/D+Q;=# P-3N[:2PJ&//E[J#2EQ^CNX$Q
MB;>,Y:NV8PI3RUA19LJ<VL:J.\<V8P00"8R9N-.LS.L[!_$>[?=-\=0V9@2M
M=N7L'H.I;PJ3W3=5:MA]8PG!W.Q,Q13;6)78M$TU,+9M3'5-4T6!W3&5#TP9
M)F+ZG[-PVU!G#9,SELIMQU3:M&TS<L(RS$PD@!Q5W;X\!I.A-@]T5]W%/DKB
MQM97C&4[0^6%R=C;KC;,G5<@FBW:Z9IBJM\S5AO:IE9JNK8IRVPV3<VNV3;6
M ALK"YQM*QE_BZ=FVU26:E5+O+,S3TW:,]:VV%UCRPZ&4@((RE#OVH>FS$SJ
M=,RMWB.JMID([)AKJ0VB:M-!LQ+3(U;\FH96_/J0/LU@ZD!:,".G#C2PIL+=
M VOECY#X R7B8S YAAZ^8.0T%:0&/3.9&#!US;6+QFI$8RVLTS*5/P==0\&.
M=CMF'*]E+,' [$PU5+9M*JH,#!4L,+F^*8%W#,T.2FEC_MN_SRZW/*_Z^]L:
MWHI@[5F8@436-_2<O0O-A*'6NTO;AICJT;8A!?=HQU#2Z-)N=3WSJ";>3%@%
MY?4-N10(RM#2(&(R9%!@489"M$%4/<@;IGK!@:%5BNYJX\V/_;AK6^E%ZLZL
M229"M3?[4:\3_)\(B"NSRL2SOEW]A[#6A56YU71\=#)^GKVF,9O'J\VFR($K
M0E#1.?D@@ %?OP&BMW.C4$)!0E I2#_A=\D!\03>#T4RPUW5#VU6U?-2 PKW
M\0J]DE  B3G__FVD9=KX!LMR:RFQ;O2N4!.[NK>_)@&D[[A[3HY454?>ZJJ.
M'+,TA'-)AF3/W0<3CQ;2G\X2X@P&$)R;^(@/]TYG8&,Q26[!1,@;D88>0]N'
M6I'X$,_!BW@8@YL=$ 9ZB91;70:<%LBKV>:3_<FA'6K_1 HCP @M%D0S!BR!
M#@E,/0IXPI$.'@-1P%H B6]"\H+(;L?NVNT#LG<42=)L*>;W#\BQ'Z9W#9^U
MFHVIZ^*:*87TXN$F8:)D5< U2Y)HV,@WO>=%,-3#E0ITGU&#K]W AZ1(WJ,H
M]9L.H#^;]GJ@,.CY<'8K/;[[YPF<R0BE82N%]B@Y"@*B;D,:YL#D#?=HY?QF
M3S^M]Q_>6>KU.C+CS(,9:0=76^U9(F31C@HGO\=LRH?;FI9L\SK.@)Y@Z/PB
M],L*YV2DHI *]O'A_;B7 (6KA%B70B0*!5CDC(SP[Z%RE:D/;1!15V]]$#2^
M"P#SY:&'$4J4\&S_X4L(D%)8&H #*#X17X4(@*$-9O!W#T/@GD_.CR C5.%A
M 1%:'B+3;YHM^9'<\R7D6.#(#Q_!4QQQUY_X*O&60TV9'X^,-!$A%TNF<GX*
M-I=SY6;O+('=%(CMQ-Z2%KF=^>YL$^D$PB:^(!1R2,@QDXMJ]OT0'*%,Y)VZ
MF+V$M&9N E$"$98F8@X1TV5!\ !^B%^7 L)*65WB5M7J*E>BMT.+7\UKP;'6
M<:FB@8B)$N8D!8[('RD+M/[6@'82;XREBA+DY8(PT US2_H_Y3&8*_08E9'-
M$^XSQ#8@] H)Q2JE^9C14)# _8(G%?Q!2IFBAI^!0SG6I&8\B.B6\%I;<?,U
MBXG?R/NC4U55$U C*RIN;3S:EC]9;(&[WXHRF!K\2 8.6D9\'D*3#6CKFB]B
M\#=.1OG1A8J#-1((-RM5M.WE]XOPZI)ZHVN% $\!@;KZ,'"$)KQ./8Y!#1X@
M6/*67]M@?0F[!E8#3_9OP,@1?@E*]B!T>/YD G9 )E+,MY'<+[&G! <:T3'Y
M OT,\:M6)YM8I7#AIM+S=G Z?J,J<?H*2FD50S=TJ6)+34U)W/C003#/4[T3
M"[)D4"88@(,4(6"Z_#9/'7 6B3C>* 8M%UJ:F"C#\?P86J@%P4L09K#-B\D>
M>!"$2LB&N5TBZSF/)<$E,2.CL_'1Q>^GQX>(LF!+_IR#YMD\PD [$])/%AO@
M2%NCP*,+Y2CK%J$NY#J 8>O,%I&!'.X69#03X,(@/:C<XL.OPQ'Z\N$W)2:X
MK:HY\&(81+)!:GXXZH!P.J5Z(-4#*820H=-LM;>0TKZ ?Y<*7W>$ KV]MV=G
MG[!$'W]\^=MX?P,;*E#J&*_S V);Q7S$Z<I%E(BI9!'D2X47.HI<^7([1@4[
MRKG+KRJ4)0^+MS/Q*![PG5XR9R&;8C+<'@A6A(J\K2+ _4R"DYGB$L._-G)T
M:Y;@\M"]Q(J<+@&J6$4C-<_KNI_>3V^=W760*G[GGGENYUBV3:$P]J?KJP=E
M@D7I%H&VL[Q1"(#Q8!(G%B;GIR\&"B>_9;135044;N5L?;5&2!S"C X4W]:O
MZ)R/UT;Z\$*]W7WXC5)*K/<C+,+R015<A.(V)!G.N,A&35F'Y'_4:K_J;I$7
MS +NI/DSJ348E) K@UKM)1X5<X3D-WF<A_B>I'$96(00]1* U0<K]TX$A%N1
MS+2U0.U=@O0X+F9 )CGE<W'#"20Y:!%4&M\:4&J65C5 O%8'A:DA-95P,?3&
MB2?2,CWHGP$O0(\Y=!Z*41RK"PI?YOTUS+0$B*8&8&<S*%J5V>66*W2-2$ V
M+-=("5:OG +T.W6 X]:8WG-GT(KO(R)&7HY/0=I1L"BA  ;=0(0@J>4*+8Q&
MMI7$-D>KTL=#;;)P6JR82H.AJ H35ZGO$QZB%+7L2HPJK6S40C4KYL%$PR_M
M#6I3N)C5604D*E0L5RV!K3*RO'(L,E]1+M96M?'GO#)>IZC$>[\KO47E57BS
M#C)?2RY=7(*",F)8*T%H2]M*=R.@I2'T:]=-VW[Z8)8M#I$5R2\6A!N,/G\1
MR]*1YX6*2>=X\8[BN"]T^N<Y65 HF0O8]MY@"8"J\4/MWP!]@ WR&@%+"63_
MQY.&[_F.S-G'C\?C]0_);'S;I?/CRRX/?=E%GSWX:1<]8SU8+9:J[[JH/[93
M]5V79KOT69>\8<6L"144F"KT=_AM%7)W=]<D+XA3^JH+N?>W^4$77#;R>>"1
MC#&%4JV@80LB.?-4>Q9DR>0)OK>BC?(Y'H+IO\_U$*SL;$_Y$&R'O48K$:2)
MCT=JVQ%4HF/,BL<"UVK'#)1>M==HYRV<^.JOJ0U"#VPEVYDG>_FR]8^T\6.[
M@[GM#G7=]UC D\7G4;+ 2]GS@N6%\CFNU5NZM!K6M57K,[!MR<(8)Z@6PX:D
MT[:=>3&&8-A&'HB&P8#]%$5? S_7V?!#C]]1/*S7XQE<7O)=A_IT=:*EH$0C
M]7.">AT9Q2HO57V?WAVIRW?UP$+@LQ ,6!"4N:H:APID[0;*G0C73:4$2[J=
M86.6883;";92F#:']8K9,X]%$.7B92I07.:74<W#9EM_T,PPY=WEKKAPNO9_
MCPUE_:LJ4C$T:"E^H#:_Q3_*YK0KT/JHP0Y'#?45UX;^HJNRE\/_ %!+ 0(4
M PH    ( $(HESAX-G*G" X  .55   2              "D@0    !E>&5C
D=71I;VY?;&]G+FAT;6Q02P4&      $  0!     . X      
end


Mime
View raw message