harmony-alerts mailing list archives

Site index · List index
Message view « Date » · « Thread »
Top « Date » · « Thread »
From nom...@intel.com
Subject [build-test alert] FAILED Linux x86: jdktools-test debug
Date Fri, 18 Apr 2008 21:27:04 GMT

BUILD FAILED:
	Ant Error Message:
/export/users/cc/cc-common/scripts/cc-exec-adaptor.xml:104: The following error occurred while
executing this line: /export/users/cc/cc-common/adaptors/jdktools-test/adaptor.xml:24: The
following error occurred while executing this line: /export/users/cc/cc-common/build/checkouts/hdk/working_jdktools/build.xml:242:
The following error occurred while executing this line: /export/users/cc/cc-common/build/checkouts/hdk/working_jdktools/make/build-test.xml:60:
The following error occurred while executing this line: /export/users/cc/cc-common/build/checkouts/hdk/working_jdktools/make/properties.xml:336:
The following error occurred while executing this line: /export/users/cc/cc-common/build/checkouts/hdk/working_jdktools/modules/samsa/build.xml:151:
exec returned: 1

Date of build:	2008-04-19 04:08:48 +0700
Time to build:	18 minutes 9 seconds
Last changed:	04/19/2008 00:04:56
Last log entry:	hdk

***********************************************************
Errors/Warnings:	(57)
            
========================================
Testing jdktools binaries...
========================================
Compiling JPDA tests
Since fork is false, ignoring memoryMaximumSize setting
----------
1. WARNING in /export/users/cc/cc-common/build/checkouts/hdk/working_jdktools/modules/jpda/src/test/java/org/apache/harmony/jpda/tests/framework/TestOptions.java
(at line 505)
internalProperties.put(name, value);
^^^^^^^^^^^^^^^^^^^^^^^^^^^^^^^^^^^
Type safety: The method put(Object, Object) belongs to the raw type HashMap. References to
generic type HashMap<K,V> should be parameterized
----------
1 problem (1 warning)
JPDA exclude list: /export/users/cc/cc-common/build/checkouts/hdk/working_classlib/deploy/build/jdktools.jpda.exclude
Running JPDA tests
Debugger JVM=/export/users/cc/cc-common/build/checkouts/hdk/target/hdk/jdk/jre/bin/java
Debuggee JVM=/export/users/cc/cc-common/build/checkouts/hdk/target/hdk/jdk/jre/bin/java
SAMSA exclude list: /export/users/cc/cc-common/build/checkouts/hdk/working_classlib/deploy/build/jdktools.samsa.exclude
Running SAMSA tests
test.jre.home=/export/users/cc/cc-common/build/checkouts/hdk/target/hdk/jdk/jre
Run jdk/bin/java -version in /export/users/cc/cc-common/build/checkouts/hdk/working_jdktools/build/test_report
Run jdk/bin/javac -version in /export/users/cc/cc-common/build/checkouts/hdk/working_jdktools/build/test_report
java.lang.reflect.InvocationTargetException
at java.lang.reflect.VMReflection.newClassInstance(VMReflection.java)
at java.lang.reflect.Constructor.newInstance(Constructor.java:283)
at org.apache.harmony.tools.javac.Compiler.initializeInstance(Compiler.java:121)
at org.apache.harmony.tools.javac.Compiler.initialize(Compiler.java:100)
at org.apache.harmony.tools.javac.Compiler.<init>(Compiler.java:91)
at org.apache.harmony.tools.javac.Compiler.main(Compiler.java:55)
at org.apache.harmony.tools.javac.Main.compile(Main.java:78)
at org.apache.harmony.tools.javac.Main.compile(Main.java:52)
at org.apache.harmony.tools.javac.Main.main(Main.java:33)
Caused by: java.lang.VerifyError: org/eclipse/jdt/internal/compiler/impl/CompilerOptions/optionKeyFromIrritant(J)Ljava/lang/String;,
pass: 1, instr: 11, reason: compound instruction: method length is less than required
at java.lang.ClassLoader.defineClass0(ClassLoader.java)
at java.lang.ClassLoader.defineClass(ClassLoader.java:438)
at java.security.SecureClassLoader.defineClass(SecureClassLoader.java:70)
at java.net.URLClassLoader.access$3(URLClassLoader.java:1)
at java.net.URLClassLoader$URLJarHandler.createClass(URLClassLoader.java:437)
at java.net.URLClassLoader$URLJarHandler.findClass(URLClassLoader.java:367)
at java.net.URLClassLoader.findClassImpl(URLClassLoader.java:1193)
at java.net.URLClassLoader$4.run(URLClassLoader.java:888)
at java.net.URLClassLoader$4.run(URLClassLoader.java:1)
at java.security.AccessController.doPrivilegedImpl(AccessController.java:171)
at java.security.AccessController.doPrivileged(AccessController.java:64)
at java.net.URLClassLoader.findClass(URLClassLoader.java:890)
at java.lang.ClassLoader.loadClass(ClassLoader.java:593)
at java.lang.ClassLoader.loadClass(ClassLoader.java:319)
at org.eclipse.jdt.internal.compiler.batch.Main.initialize(Main.java:3297)
at org.eclipse.jdt.internal.compiler.batch.Main.<init>(Main.java:1388)
at org.eclipse.jdt.internal.compiler.batch.Main.<init>(Main.java:1384)
at java.lang.reflect.VMReflection.newClassInstance(VMReflection.java)
... 8 more
Uncaught exception in main:
java.lang.NullPointerException
at org.apache.harmony.tools.javac.Compiler.main(Compiler.java:60)
at org.apache.harmony.tools.javac.Main.compile(Main.java:78)
at org.apache.harmony.tools.javac.Main.compile(Main.java:52)
at org.apache.harmony.tools.javac.Main.main(Main.java:33)
The execution FAILED with the following exception:
The following error occurred while executing this line:
/export/users/cc/cc-common/adaptors/jdktools-test/adaptor.xml:24: The following error occurred
while executing this line:
/export/users/cc/cc-common/build/checkouts/hdk/working_jdktools/build.xml:242: The following
error occurred while executing this line:
/export/users/cc/cc-common/build/checkouts/hdk/working_jdktools/make/build-test.xml:60: The
following error occurred while executing this line:
/export/users/cc/cc-common/build/checkouts/hdk/working_jdktools/make/properties.xml:336: The
following error occurred while executing this line:
/export/users/cc/cc-common/build/checkouts/hdk/working_jdktools/modules/samsa/build.xml:151:
exec returned: 1

***********************************************************
Unit Tests: (155)
        
All Tests Passed

***********************************************************
Modifications since last successful build:	(1)
            
add cc-hdk log20080419000456Lbuild.831 04/19/2008 00:04:56hdk

begin 644 execution_log.zip
M4$L#! H    ( %TCDSB9#.>MI0D  !8_   2    97AE8W5T:6]N7VQO9RYH
M=&ULU5MM;]NV%OX\_PIBV,42(*:L5\MJ&B!(VS5=TA5-EOMAV!UHB;:9R*(N
M127Q?OT]I.PD2FS'3LY:7*-%9)%\>'C>21_N3_0T/]@?RFQVL%\J?K#/2*5G
M.7_[\T@6NEN)OWE"XMZ_WOQ\T*G+C&G>K:Z+I-/I5ES79?<RN])2YE7WIC(O
MYUW:;U4- ][592Y2:,Q(J>0E3S4IV)0341 Q+:72E'R9OS^79?>$7_/<]"RY
MTC.2\9$HA!:RJ)IG@!D)56DSWN&W!L"I*ZXJ)TWA7S>5TZDLG"I5HM25,P<2
MO**WTYRP(B-LS,S<:X</:Y%G3CKAZ96L 6:273DW4EV)8OS78HW.E%WQ1Q-T
M.II7.ND0\_F#IQ/Y)^F\W?#3.8>Q, -9S$"&HF#*0%.Z.4HGS3DKNH:0J@O4
MES40U$EE.>M>*MX=B9P;X:23J<S:;^9=DF8576BO;8M=S/0J$^I/<J2XE25\
M25[-P::3F>POQ0W2MYBJZG3LEX9#;5D=R6DI<B.#3U_>'9*F^[>@R4ES5E5\
M/MDENV;I0VJ\ODLJ6:N4$RLMHN4_/ON9*,QT,(R(BHQ87O$](L:%5(:B*9]*
M-3MEMV):3\_ 6Q#P"T9[6QC=NT_KM4O)OP^_?C[^_ N*'39ZZER"#W(JE=HU
M.68J1ZJQPTH& ,Z$*4"<-;V:58\4."(#YQC+^ZVT;H::@2UJR0[3!,3 2=@+
M=UM-/XA"<U6P_,N]&P![VS$>;H]<L[SFNV_:(_[S_*<UX'Q6 F_9B.M90LXG
M'#BO)Q*<*4SSV]#XS3W2_-TE0Y[+8FRU0T-/Q6Z(-L,_LFIRRDI*OO(15QSD
M:ON,><&52%M]]G_=NS@@U436>09XI&2&2;!($'&VD6R-\Q[F?$IV7'+#5 &R
MVNUT(,8 %._RVS2O,]XV.VML\Q;@-'C0ERJ%5>1<#)V,E[F<S?LN5(4:X=/Y
M1#8^+7,"7^NB6.("%LV$O./#>CSFBGRZ.'V[):&:J3'7]O'2_%?< 2_OW"G=
MDUGX/S'+'Y<U1-7[I8*=T,9.Z-Q.&E;9U=/+[*:D%T+IFN6GT E,@5X '6 N
MQG!:B.9%14SD)^X>^<!$7BN((:2W1]XK)57S>"X@ ^ Y*RN>)22B_6@ _B-]
M-5) O7Z A-2+0B2DH.<A(?4#'P7)IX,8B:2!&R$A^?VU;/(W17(]&J_7)V]3
MJ)B&81]+G_HXC.K3T$=C5#A82U2P*907T0A-$7H>CG*"EJ,9GH>#%(+AK5U<
MM/'B@$^QBZ3E:W&V8)/KX^C @'H]K(C@>CA(/G4#G-ABD-;2M+'9N1 ZUSN#
M;8P%R4&!8O:P&(6'A)9AN ,<:P&&NUA!N(<6SET7+7\:X.0J)C' RGIZ6!KN
MNEB+>P9I"R<>1UC1+@C11.=AA18?*1T')>CCI'3@QGM8KN"9@/!=:!KTT9Q*
M@!:CD!R=V0#A^ +0)Z3<T&PYT2(P'A*2[ #)1PMWZW/HK?0)AT\>6 N.5S%(
M:-DXFJ-#4@)87(SG"M"R51PD6!Q2!,;3IH!ZZ].PC0\+/)]Z:$XE]G 2C) &
M/H[P^C2.L;),K+TK(.'M$-#LSO6PM,!#.EOSJ;]6=.'&0"YX%:Q3WQY6ONJ&
M6'M@'VE+9O8:.*)S(4HA;<I<O&VP@8IQ;-@LT,6*5(/UN?W&>\4^=9&.0V+J
M(_TD$3YW:+^-8XFP+*:_?I>P,<<C2'S6^H,M9/?,.=WFQ_\A]3PL)S5 \^4#
MI&T"WA8/TK$ ;3N%QB8<R;DT0LJ@?!H@'8H9'4 [\7-QCD/ /2$=9?DT'F"=
ML89HI[4!WK'1DOSPY74&'V6>O;_FA:Y02@UBV@]P%AI%-$2RP3[:X68?Y(CC
M8  I1D-"^F')Z!;.+B;JTP@I5^S3$.GL%N\G],A(#XU3 5(8-6J.E9<A_; ?
M>7?95$?+.IUT1_-QMBHV6;SE%N#N';^KCDV>J6P[.SP]^S:E;16;5O>U;8:"
M5!8I \9\ED" :$J+F^I14P9=2%+ .GA&-+_5>R23IKV0>F**.)^KC6O693NT
MVLT;>JG O<LI?WW5VN.Y36GT724;Z5XW16@81:3+2Y%AZEN>_DD.;<PB'YN8
M14Y87<!W11*RD^Z2(UG.E!A/-'$' ] ]K]>+;:GF?-B9'.D;4!'R0=9%QDR9
M*41"(D!=<Y'RH@+=VB,,Y%+:6OEASFEK>KO:Q6)_=&E(>S^25@]0PB[+RPD#
MDD"&!)9>YEQS,X]YADD!M36DNB[(6Z*B8!"Y0/3.8:F ?DO\[AXY$45]ZPCF
M>\XX3<UA,@7KR4Q-(K&\:F%-M"X39U%CNPCQ$.W7"C#]AA(T\]&<%6.J^"CG
MJ:;'Q;5,K3#.K=Z]OTVY+0%NC?N!Z25C+TZ_-D_0G1;\YLC8YG%1:5:D?*?5
M:@;O;@!Y)&&XJE,ME4&\ WOXWHQ*O-A_BK<DL9I7O!H^TZ:2G"MJ+U.P7/S-
M'TPP;[/HKN=BH#]&[?5>CKIO8 \>(0Y>0>:4B>(17!AN#7<**#1M4';L%XO4
MC[&00N]E2'9Y]S#^(W4Y8F!A&1G.D@=:>,&5&,ULG$S,) Y/<P$Q$ARQ=A9%
M[LZ<1N4(\"[.@H/SPGE'VK^_\MD'):?'2@G0+[WS:??$EN*;:9PS;2X/O-DC
M)=B+C=/":#<\P:/BK)(0O<TLQE$V;;4UHV11]I[S8JPGYD8"!+**Z DK8.!_
M:Z%XML;*K(&>2):!P)M[1/9-;^=APW.FN@+D"482^$N4P.) IE$#8V;TS#SP
M58A/6QO=6F)%%K;@FO[^]>3A ):FP*"?_)U'[QM[W!CG)_CZB:F/D#(88TGM
M_9>&R&7 @=]_*32L/EL-[$>; ]]#'8.>+F> .UCB15<1&E!(AY;BQ/$J26\%
MLTH>=^IR:*4)L4 KF1MN9?*+$M=@?F.>V54^Z=$ ]U\'O0(V"EX@C.4,'*S2
MZ2<FE\.?%087KI3F-BB^.UCN<>?.D((SI MGN'#8B@Z93B>-ZWT0 !\X8&^P
M1'>WPIV'P'M,UU^F>*_&7"56Q.2'4DIB,I6JG8W^#GN5VJ30?)&&F9S0A+)D
M11[WN<[S+](N<77J]HJ4(-H^9?E_2@DZ9H-B4&K+[ ^'QR?OWY$; <'5W!T;
M@;7+&[/5NQ-(8H<\:##9 I$I^!$(ON1F K0N$*$9-I*5O3:7=-:D]BQC):2V
MU=U&UNXZ%Z_-G=K$"YJ+;\@S;[ZIF%/A?3\R[%7C^UNKEJ"H]YWI:5]]!J6*
MOB-!\SN@]A3D@=3<T$WLC) DZEH5]B>/SK[##O8=>^W=::[ ._8^_/\ 4$L!
M A0#"@    @ 72.3.)D,YZVE"0  %C\  !(              *2!     &5X
F96-U=&EO;E]L;V<N:'1M;%!+!08      0 ! $    #5"0     ! 
end


Mime
View raw message