harmony-alerts mailing list archives

Site index · List index
Message view « Date » · « Thread »
Top « Date » · « Thread »
From nom...@intel.com
Subject [build-test alert] FAILED Windows 2003 x86_64: jdktools-test debug
Date Fri, 18 Apr 2008 21:01:37 GMT

BUILD FAILED:
	Ant Error Message:
C:\cc\cc-common\scripts\cc-exec-adaptor.xml:104: The following error occurred while executing
this line: C:\cc\cc-common\adaptors\jdktools-test\adaptor.xml:24: The following error occurred
while executing this line: C:\cc\cc-common\build\checkouts\hdk\working_jdktools\build.xml:242:
The following error occurred while executing this line: C:\cc\cc-common\build\checkouts\hdk\working_jdktools\make\build-test.xml:60:
The following error occurred while executing this line: C:\cc\cc-common\build\checkouts\hdk\working_jdktools\make\properties.xml:336:
The following error occurred while executing this line: C:\cc\cc-common\build\checkouts\hdk\working_jdktools\modules\samsa\build.xml:151:
exec returned: 1

Date of build:	2008-04-19 03:35:22 +0700
Time to build:	26 minutes 7 seconds
Last changed:	04/18/2008 22:37:33
Last log entry:	hdk

***********************************************************
Errors/Warnings:	(57)
            
========================================
Testing jdktools binaries...
========================================
Compiling JPDA tests
Since fork is false, ignoring memoryMaximumSize setting
----------
1. WARNING in C:\cc\cc-common\build\checkouts\hdk\working_jdktools\modules\jpda\src\test\java\org\apache\harmony\jpda\tests\framework\TestOptions.java
(at line 505)
internalProperties.put(name, value);
^^^^^^^^^^^^^^^^^^^^^^^^^^^^^^^^^^^
Type safety: The method put(Object, Object) belongs to the raw type HashMap. References to
generic type HashMap<K,V> should be parameterized
----------
1 problem (1 warning)
JPDA exclude list: C:\cc\cc-common\build\checkouts\hdk\working_classlib\deploy\build\jdktools.jpda.exclude
Running JPDA tests
Debugger JVM=C:\cc\cc-common\build\checkouts\hdk\target\hdk\jdk\jre/bin/java
Debuggee JVM=C:\cc\cc-common\build\checkouts\hdk\target\hdk\jdk\jre/bin/java
SAMSA exclude list: C:\cc\cc-common\build\checkouts\hdk\working_classlib\deploy\build\jdktools.samsa.exclude
Running SAMSA tests
test.jre.home=C:\cc\cc-common\build\checkouts\hdk\target\hdk\jdk\jre
Run jdk/bin/java -version in C:\cc\cc-common\build\checkouts\hdk\working_jdktools\build\test_report
Run jdk/bin/javac -version in C:\cc\cc-common\build\checkouts\hdk\working_jdktools\build\test_report
java.lang.reflect.InvocationTargetException
at java.lang.reflect.VMReflection.newClassInstance(VMReflection.java)
at java.lang.reflect.Constructor.newInstance(Constructor.java:283)
at org.apache.harmony.tools.javac.Compiler.initializeInstance(Compiler.java:121)
at org.apache.harmony.tools.javac.Compiler.initialize(Compiler.java:100)
at org.apache.harmony.tools.javac.Compiler.<init>(Compiler.java:91)
at org.apache.harmony.tools.javac.Compiler.main(Compiler.java:55)
at org.apache.harmony.tools.javac.Main.compile(Main.java:78)
at org.apache.harmony.tools.javac.Main.compile(Main.java:52)
at org.apache.harmony.tools.javac.Main.main(Main.java:33)
Caused by: java.lang.VerifyError: org/eclipse/jdt/internal/compiler/impl/CompilerOptions/optionKeyFromIrritant(J)Ljava/lang/String;,
pass: 1, instr: 11, reason: compound instruction: method length is less than required
at java.lang.ClassLoader.defineClass0(ClassLoader.java)
at java.lang.ClassLoader.defineClass(ClassLoader.java:438)
at java.security.SecureClassLoader.defineClass(SecureClassLoader.java:70)
at java.net.URLClassLoader.access$3(URLClassLoader.java:1)
at java.net.URLClassLoader$URLJarHandler.createClass(URLClassLoader.java:437)
at java.net.URLClassLoader$URLJarHandler.findClass(URLClassLoader.java:367)
at java.net.URLClassLoader.findClassImpl(URLClassLoader.java:1193)
at java.net.URLClassLoader$4.run(URLClassLoader.java:888)
at java.net.URLClassLoader$4.run(URLClassLoader.java:1)
at java.security.AccessController.doPrivilegedImpl(AccessController.java:171)
at java.security.AccessController.doPrivileged(AccessController.java:64)
at java.net.URLClassLoader.findClass(URLClassLoader.java:885)
at java.lang.ClassLoader.loadClass(ClassLoader.java:593)
at java.lang.ClassLoader.loadClass(ClassLoader.java:319)
at org.eclipse.jdt.internal.compiler.batch.Main.initialize(Main.java:3297)
at org.eclipse.jdt.internal.compiler.batch.Main.<init>(Main.java:1388)
at org.eclipse.jdt.internal.compiler.batch.Main.<init>(Main.java:1384)
at java.lang.reflect.VMReflection.newClassInstance(VMReflection.java)
... 8 more
Uncaught exception in main:
java.lang.NullPointerException
at org.apache.harmony.tools.javac.Compiler.main(Compiler.java:60)
at org.apache.harmony.tools.javac.Main.compile(Main.java:78)
at org.apache.harmony.tools.javac.Main.compile(Main.java:52)
at org.apache.harmony.tools.javac.Main.main(Main.java:33)
The execution FAILED with the following exception:
The following error occurred while executing this line:
C:\cc\cc-common\adaptors\jdktools-test\adaptor.xml:24: The following error occurred while
executing this line:
C:\cc\cc-common\build\checkouts\hdk\working_jdktools\build.xml:242: The following error occurred
while executing this line:
C:\cc\cc-common\build\checkouts\hdk\working_jdktools\make\build-test.xml:60: The following
error occurred while executing this line:
C:\cc\cc-common\build\checkouts\hdk\working_jdktools\make\properties.xml:336: The following
error occurred while executing this line:
C:\cc\cc-common\build\checkouts\hdk\working_jdktools\modules\samsa\build.xml:151: exec returned:
1

***********************************************************
Unit Tests: (155)
        
All Tests Passed

***********************************************************
Modifications since last successful build:	(1)
            
add cc-hdk log20080418223733Lbuild.600 04/18/2008 22:37:33hdk

begin 644 execution_log.zip
M4$L#! H    ( # @DS@FAP@76@D  "\_   2    97AE8W5T:6]N7VQO9RYH
M=&ULU5OK;]NV%O^\ /T?B&$72P";UM.OI@&"M+U-EW1%DV4?YMZ!EFA;B23J
M4E0<[Z_?(24GMN-G<MIE1@O+(ODCS_N0.3P<J20^.NR+<')TF$E^=,A(KB8Q
M?_/S0*2JGD=_\2YI6_]Y_?/1J[TB"YGB]?PV[;[:>[57S[DJLOIU>*.$B//Z
M."]?5]T6W\M"#WM;9'$40'M(,BFN>:!(RA).HI1$22:DHN1S]?Y29/4S?LMC
MW3/C4DU(R =1&JE(I'GY##"#2.9*CS_I]H( _M4#D20B[>6!C#*5]ZK1$<_I
M71(3EH:$#9F>\/&8?A'%82\8\>!&%#!V%-[TQD+>1.GPSRE!O83=\ 543:#B
MN0(*B?[\P8.1^$KVWFSYV;N$P3 )F4Y"^E'*I$:G='L4O8P@YBRMZ\7D=: A
M*Y1A?R"R2?U:\OH@BGDID6"4B'#Q7=6M.Z6H#GV*LM40EMR$D?Q*3B0W0H0?
MW:=QL>RDI_A3<BWY;S=!KHDQ/TN^+$CI1"19%&ON?_S\]IA4([[98GI!S/*<
M3Z>X9K<LF%V$T[))+@H9<&+D0I3X1G->1*F>!,:1*"<#%N>\1J)A*J1>1\(3
M(2?G["Y*BN0"/ $!@]=*.@]2O__,O[<I^?WXRZ?33_]]NJ&5JM>[!H_2RV5@
M:.EI_)Z0PQ[+& #T1DP"XJ3L55([D.!3-%Q/V]6OF?$85 ^<7R/99XH TSGQ
M+?]@ONV'*%5<IBS^_&#I8$S[VEW5R"V+"W[P>F'(_S9_YD=<3C)@*QMP->F2
MRQ$'IJN1 -\($_W:UVZP1LKO ]+GL4B'1AT4])1L3)0>_H'EHW.64?*%#[CD
M(%+39\A3+J-@KL_A+[6K(Y*/1!&'@$<RIAD%9()TPRW%JKUQ/^8)V;?)F,D4
M)':@[0O"!\#Q.K\+XB+D"S9F+*MJ HZ#I]Q))8SZQE&_%_(L%I.J[U11J!8]
MK="K6+/4TK\4:;K,SJ?MA+SE_6(XY))\O#I_L\T*%9-#KLSCM?XO>0-<=^-!
MUQYA<SSL/ZX+"(</=(%5T-(J:&45)6L,J?0Z'&?T*I*J8/$Y= *]IU=<YF <
MVDSF(?6;G.B@3>P:><^BN) 0!8A5(^^D%+)\O(P@=O.893D/(5&@GM4$+Q$\
M'ZI%'=?'@O(<!VU5G=:+@VI2KXW&*P<-R>VL17*W17(<:MGKU<K9%LOVJ-]T
M7Z"*;E*&[;EETZ:]%LK;%LJW8%EM- J;:*[!]M93N+W#PEI1QUTOON:V4%Z3
MNK:'INPN'L]]-*B6NY[ ?T(34(-$RU[O^K:V0*=%_=9ZK!V6Y7MXL:N)%R:<
ME^EB7EY M3IX=H-F-GB^F%IXD=ENXZFZA<?U#:O:Q;-O"/+?/P3:/B++\5(T
M1.GA14#707/JCH]FRIC^!2\NVRT\KX 72^T-.Y*=H- ,Q\7+]SP/+6XA$FA[
M>/[*Q=,KQ,!EX1U5.'AG,1[:JJPVGN%8>*X/[P#%=E\BK]P-<7#K\P57GR\@
M1B^\I*&%QG>_B4:@A4<?8LZ.Z) 1XR">%]W =7]K9?<IXFGAB_16>/+SL)):
M&Y:%"-5&XKO&PCKVL'5,1=(LV#AO@-IE7^EX:)L Q!-#/"WU\>BSVY@'M>LU
M?B<LK#\E@#98>#LFO%"("&5U\*+J!K[OLBHT=;=:2![+I4X'"<JG';P_G&$*
MT$>+]5@QYZ4J**:N+]/0IQ<T?!!Q^.Z6IRK'J6FP;>IA[<F;'6IAG="T:=M'
M\LUMVNF@0;5;2/$5>(7X1Q@T$0*SL/)<1&8!%-*B-(%8?-=8:"J*Y9S;U,4R
MG*9.1:H#R5=[2A3!J#ZH1IJ:VN[#>VY 9M[R^]K:[N;RN8OC\XMO6#^7LR2?
M*:#3\P8B#1CPY9. ::.R.+DL1]4%U*D@*1# 0Z+XG:J14.CV5*B1J0_=7(%7
M$F1ZS'?0K^BU!'\O$O[$*KE'4^JRZOO2.5*_+8O>GER7NJ)T&2:\X\%7<FP"
M%OE0!BQRQHH4?DO2)?O! 3D1V41&PY$B=J<#JN98H$*Z]+,:=B$&:@R:0-Z+
M(@V9+EV%,$@BT,XX"GB:@QK5" ,Y9*:4OA]S.C^_(7)*XX\V]:GU(YGO MI6
M9W$V8K HD!H!ZK.8*ZYGTL\P+>#.C\EO4_*&R*;7\5O-&MD_SB2QVV;]!S7R
M>Y2&8IPW>-+T5"/);P/8BEA@,J&N>B2&9?-X(Z6R;J,QC>M5F(>(OUY\P3>7
MGYZ%QBP=4LD',0\4/4UO16!$<6F4[=U=P$U1\?S 'YA:,OCJ_$OY!/UIRL<G
MVA9/TURQ-.#[<ZUZ\,$VF"<"QLLB4$)JR'NTV?=Z5-=INTL EZ1552&M9C M
M:]&YI.:R!8NCO_C,#%6;@;<=&P5^$=:RG@%[J'&/%B [SUEHPJ)T <_W=\<[
M!Q@:E##[YH>!:K71H'SGB5"&P@<<=U%K3E@!(8_T)]T9;;SB,AI,3'CLZED:
M/(@C"(V-ZU UIN7SC6J5LA&!CVE,N5@5Y3>$^?Z%3]Y+D9Q*&8&:J?V/!V=Z
MFH:>IG&A]'V$US62@>&8\!QI+=>Y>8U(SG(!05O/HAUFV588>^I.R^ECG@[5
M2%]R@ "6$S5B*0S\?Q%)'JXS-V.J9X*%(/7ROI%Y8^W/-FPTVA4HCT"ZGKM,
M$PP0Y!@%\&9"+_0#7P7YN+74L&7F9'!3KNAO7\YF1[ @ ";]Y.XOO"\M<WN@
MG^#G1R8_0+Z@K28P=VC*92Y#]MS6D[&! >%J9+>Y _(#UBFHZW(>V)UE3G75
M4CT*R=!2H'9[I;QWPEDIE'NM.38RA>B@I(@UQT+Q64:W8(A#'AI"'_4HD5O/
MQ%Z!V_2>(I$53%SFB9=;7PQ?*VS/7RW376!<N[/" U>^D8)OI%/?./7@DO:9
M"D:E*YZ)BC,.V>DL4^*=@*NX^ !JNTL5\-F@*X6+F1=12DF;)$(NI*F_P;ZE
MT.DUGR9I.D_4\:V[*LW[5,3Q9V'(7)/9/2-9:#XAG?F7)0M[>@NC80K#\O?'
MIV?OWI)Q!&%7WU8;@/&+L=[YW8NE:X;,-.@\@H@ W J$93(>P6JGB- ,6\O<
MW-4#,2YF_2QD&:2\^?V.UNP]IZ_U!=VNXY47[%#FVWZ74<WM?._)S1WEARNO
M9AE-ZQ]9Q?Q-:="6YG=?1G6/U!QSS,C%]NVNF0>2057(U)SW[KW:.VRPH\.&
MN0_?*._&-\Q%^;\!4$L! A0#"@    @ ,""3.":'"!=:"0  +S\  !(     
M         *2!     &5X96-U=&EO;E]L;V<N:'1M;%!+!08      0 ! $  
(  "*"0     ! 
end


Mime
View raw message