harmony-alerts mailing list archives

Site index · List index
Message view « Date » · « Thread »
Top « Date » · « Thread »
From nom...@intel.com
Subject [build-test alert] FAILED Windows 2003 x86: jdktools-test debug
Date Fri, 18 Apr 2008 20:37:30 GMT

BUILD FAILED:
	Ant Error Message:
D:\cc\cc-common\scripts\cc-exec-adaptor.xml:104: The following error occurred while executing
this line: D:\cc\cc-common\adaptors\jdktools-test\adaptor.xml:24: The following error occurred
while executing this line: D:\cc\cc-common\build\checkouts\hdk\working_jdktools\build.xml:242:
The following error occurred while executing this line: D:\cc\cc-common\build\checkouts\hdk\working_jdktools\make\build-test.xml:60:
The following error occurred while executing this line: D:\cc\cc-common\build\checkouts\hdk\working_jdktools\make\properties.xml:336:
The following error occurred while executing this line: D:\cc\cc-common\build\checkouts\hdk\working_jdktools\modules\samsa\build.xml:151:
exec returned: 1

Date of build:	2008-04-19 03:14:22 +0700
Time to build:	22 minutes 59 seconds
Last changed:	04/18/2008 22:43:14
Last log entry:	hdk

***********************************************************
Errors/Warnings:	(60)
            
[cc-ant]: Test Suite 'jdktools-test' execution. Repository updated: ${repository.updated}
[cc-ant]: Check for 'run' failure of hdk = ${hdk.parameters.run.failed}
[cc-ant]: Result: failed.superiors = '${failed.superiors}'
========================================
Testing jdktools binaries...
========================================
Compiling JPDA tests
Since fork is false, ignoring memoryMaximumSize setting
----------
1. WARNING in D:\cc\cc-common\build\checkouts\hdk\working_jdktools\modules\jpda\src\test\java\org\apache\harmony\jpda\tests\framework\TestOptions.java
(at line 505)
internalProperties.put(name, value);
^^^^^^^^^^^^^^^^^^^^^^^^^^^^^^^^^^^
Type safety: The method put(Object, Object) belongs to the raw type HashMap. References to
generic type HashMap<K,V> should be parameterized
----------
1 problem (1 warning)
JPDA exclude list: D:\cc\cc-common\build\checkouts\hdk\working_classlib\deploy\build\jdktools.jpda.exclude
Running JPDA tests
Debugger JVM=D:\cc\cc-common\build\checkouts\hdk\target\hdk\jdk\jre/bin/java
Debuggee JVM=D:\cc\cc-common\build\checkouts\hdk\target\hdk\jdk\jre/bin/java
SAMSA exclude list: D:\cc\cc-common\build\checkouts\hdk\working_classlib\deploy\build\jdktools.samsa.exclude
Running SAMSA tests
test.jre.home=D:\cc\cc-common\build\checkouts\hdk\target\hdk\jdk\jre
Run jdk/bin/java -version in D:\cc\cc-common\build\checkouts\hdk\working_jdktools\build\test_report
Run jdk/bin/javac -version in D:\cc\cc-common\build\checkouts\hdk\working_jdktools\build\test_report
java.lang.reflect.InvocationTargetException
at java.lang.reflect.VMReflection.newClassInstance(VMReflection.java)
at java.lang.reflect.Constructor.newInstance(Constructor.java:283)
at org.apache.harmony.tools.javac.Compiler.initializeInstance(Compiler.java:121)
at org.apache.harmony.tools.javac.Compiler.initialize(Compiler.java:100)
at org.apache.harmony.tools.javac.Compiler.<init>(Compiler.java:91)
at org.apache.harmony.tools.javac.Compiler.main(Compiler.java:55)
at org.apache.harmony.tools.javac.Main.compile(Main.java:78)
at org.apache.harmony.tools.javac.Main.compile(Main.java:52)
at org.apache.harmony.tools.javac.Main.main(Main.java:33)
Caused by: java.lang.VerifyError: org/eclipse/jdt/internal/compiler/impl/CompilerOptions/optionKeyFromIrritant(J)Ljava/lang/String;,
pass: 1, instr: 11, reason: compound instruction: method length is less than required
at java.lang.ClassLoader.defineClass0(ClassLoader.java)
at java.lang.ClassLoader.defineClass(ClassLoader.java:438)
at java.security.SecureClassLoader.defineClass(SecureClassLoader.java:70)
at java.net.URLClassLoader.access$3(URLClassLoader.java:1)
at java.net.URLClassLoader$URLJarHandler.createClass(URLClassLoader.java:437)
at java.net.URLClassLoader$URLJarHandler.findClass(URLClassLoader.java:367)
at java.net.URLClassLoader.findClassImpl(URLClassLoader.java:1193)
at java.net.URLClassLoader$4.run(URLClassLoader.java:888)
at java.net.URLClassLoader$4.run(URLClassLoader.java:1)
at java.security.AccessController.doPrivilegedImpl(AccessController.java:171)
at java.security.AccessController.doPrivileged(AccessController.java:64)
at java.net.URLClassLoader.findClass(URLClassLoader.java:890)
at java.lang.ClassLoader.loadClass(ClassLoader.java:593)
at java.lang.ClassLoader.loadClass(ClassLoader.java:319)
at org.eclipse.jdt.internal.compiler.batch.Main.initialize(Main.java:3297)
at org.eclipse.jdt.internal.compiler.batch.Main.<init>(Main.java:1388)
at org.eclipse.jdt.internal.compiler.batch.Main.<init>(Main.java:1384)
at java.lang.reflect.VMReflection.newClassInstance(VMReflection.java)
... 8 more
Uncaught exception in main:
java.lang.NullPointerException
at org.apache.harmony.tools.javac.Compiler.main(Compiler.java:60)
at org.apache.harmony.tools.javac.Main.compile(Main.java:78)
at org.apache.harmony.tools.javac.Main.compile(Main.java:52)
at org.apache.harmony.tools.javac.Main.main(Main.java:33)
The execution FAILED with the following exception:
The following error occurred while executing this line:
D:\cc\cc-common\adaptors\jdktools-test\adaptor.xml:24: The following error occurred while
executing this line:
D:\cc\cc-common\build\checkouts\hdk\working_jdktools\build.xml:242: The following error occurred
while executing this line:
D:\cc\cc-common\build\checkouts\hdk\working_jdktools\make\build-test.xml:60: The following
error occurred while executing this line:
D:\cc\cc-common\build\checkouts\hdk\working_jdktools\make\properties.xml:336: The following
error occurred while executing this line:
D:\cc\cc-common\build\checkouts\hdk\working_jdktools\modules\samsa\build.xml:151: exec returned:
1

***********************************************************
Unit Tests: (155)
        
All Tests Passed

***********************************************************
Modifications since last successful build:	(1)
            
add cc-hdk log20080418224314Lbuild.706 04/18/2008 22:43:14hdk

begin 644 execution_log.zip
M4$L#! H    ( *P<DSCJ"_^^BPD  #,_   2    97AE8W5T:6]N7VQO9RYH
M=&ULU5MM;]NV%OZ\ /T/Q+"+)8!-6Y(M2VX:($C;-5W2%4F6?9A[!UJB;262
MJ$M1<;Q??P\I.;$=OR8GN[U&B]@B^1SRO),Z/!RI)#XZ[(MP<G2827YTR$BN
M)C%_]_- I*J>1W_S+O&:_WK[\]&;O2(+F>+U_"[MOME[LU?/N2JR^DUXJX2(
M\_HX+Q]7W1:?RT(/>U]D<11 >T@R*6YXH$C*$DZBE$1))J2BY&OU_$ID]3-^
MQV/=,^-234C(!U$:J4BD>?D=8 :1S)4>_[[;"P+X5P]$DHBTEP<RRE3>JT9'
M/*?W24Q8&A(V9)K@TS'](HK#7C#BP:TH8.PHO.V-A;R-TN%?TP7U$G;+%U#U
M A7/%:R0Z,^?/!B);V3OW9:?O2L8#$3(E CI1RF3&IW2[5'T-(*8L[2N)Y/7
M80U9H0S[ Y%-ZC>2UP=1S$N)!*-$A(O/JF[=Z8KJT*<H6\W"DMLPDM_(B>1&
MB/"C^SPNEITTB;\DUY)_/0*Y7HSY6?)E04HG(LFB6'/_\]?WQZ0:\6J3Z04Q
MRW,^)7'#[E@P.PF[8Y%<%#+@Q,B%*/%*-"^C5!.!<23*R8#%.:^1:)@*J>>1
M\$3(R3F[CY(BN01/0,#@M9+.@]0?/O//+4K^.+[X<OKEE^<;6JEZO1OP*+U<
M!F8M/8W?$W+88QD#@-Z(24"<E+W*U0XD^!0-U]-V]5MF/ ;5 ^?G2/:9(L!T
M3MK-]L%\VP]1JKA,6?SUT=+!F/:UNZJ1.Q87_.#MPI!_;_[,C[B:9,!6-N!J
MTB57(PY,5R,!OA$(_=;7;K!&RK\'I,]CD0Z-.BCH*=F8*#W\$\M'YRRCY((/
MN.0@4M-GR%,NHV"NS^&OM>LCDH]$$8> 1S*F&07+!.F&6XI5>^-^S!.R;Y$Q
MDRE([$#;%X0/@.-U?A_$1<@7;,Q85M4$' =/N9-*&/6-HWXOY%DL)E7?J:)0
M+7I:H5>Q9JFE7Q1INLS.I^V$O.?]8CCDDGR^/G^WS0P5DT.NS-<;_5_R!KCN
MQJ.N/<'F>-A_WA00#A_7!59!2ZN@E564K#%+I3?A.*/7D50%B\^A$^@]O>8R
M!^/09C(/J9_D1 =M8M7(1Q;%A80H0)HU\D%*(<NO5Q'$;AZS+.=AEW1HQVF#
MEPA>#N52RT:#:OH.#E2;>K:'!F79W^&L6JZ/)L'F>BAG6RC+I[;KKL6RM\9R
MJ.VOQ]I%LSI(C <H9[TZ;,\MCSJ^M1:KM2U6RP:%0-,MM]U!@_+0&(_F9C;I
MJ+LME -83@M)WYO4VZ -N[!]_:RV9Q;6A!PLSP?NJH7'I@V*OK7]V3:U+33[
M<SIX(=5%"UZ.A1:=.XB\P@NI;AM/W?%RAI:#YHS1V.[25AM1&9 RF39M6V@2
M7&^!V[MUB[H;TJM=7!^6AFY.^K:&:M&.A^206WBY-D1F'\UNVHA.%$W7$?<2
M6-D"3*J-MCY$;^SB90PM&TT57 ]-07T\;XRFZ_[&W<TN"VSB!<$F$J\0CSZ 
M[0X2KV!6>'K5V;"[V6%6:%$>,?< 7J%Q'2WU<#<FCUN?,-@^9NAR\0[ZT%*B
M#I[A@+:C63.:N^J@'@K@G<6@[21T?KPA.K>W/HZ!]*KU76Y+?+0$"^UH#A)D
MK 5:B#M+C>4BV2%@^1X2YRT7+_5;+\'MMY8V;>)E#4V\^(7&*/U&""T!V;#)
MV87M>(>^]L:SONV#?1-O1X&H#H@;51<UV&-M \"]8[U<:N'E6#9MMY DV,(,
MA2T?#6K3B[B=] K18WV/I^1H[X.6.X;GUS5\$G'XX8ZG*L<I;?"IC_9BW,-[
MI]/!TPN/6ATD;?7PWJ5U:,M!T];.AA>TNXC0Z2"I/D AS<I#>Y7MX;T=PM1V
M#^\TI$/13AUT)E(QZ\V>$D4PJ@^JD::PMOOXG!N0F:?\H<"VN[F&[O+X_/(5
MB^AREN0S572:;B#2@ %?O@@@&Y45RF5-JJZB3@5)80$\)(K?JQH)A6Y/A1J9
M(M'-97CE@DR/^0[Z$;V1X.U%PI]9*O>$I*ZM?JB?(_6[LO+MV<6I*^J7@> ]
M#[Z18Q.NR*<R7)$S5J3P6Y(NV0\.R(G()C(:CA2Q?!]4S6XV/5/_60V[% ,U
M!DT@'T61ADS7KT(0)!%H9QP%/,U!C6J$@1PR4T_?CSF=IV\6.5WCCQ:%O.9'
M,M\%M*W.XFS$8%(@-0*KSV*NN*:DOP-9P)T?D]^EY!V1;LMO=]P:V3_.) 'S
MUO,_J)$_HC04X[P1,<=N)/E=0"S' HL)=>4C,1R;AQLIE74;C6E0KV(\A/OU
MT@M>77R:"HU9.J22#V(>*'J:WHG 2.+*Z-J'^X";PN+Y@3\PM63P]?E%^0WZ
MTY2/3[0IGJ:Y8FG ]^=:]>"#;3!/!(R71:"$U) /:+//]:BN[3E+ )?D5%4Q
MK68P+>O1N:3FP@6+H[_Y#(6JS<!;MH4"OPC;;+X ]E#C'BU ^B^9:,*B= &O
MW=X=[QQ@:%#"[)L?!JKCH4&U[6="F14^XCB+6G/""HAXI#_ISFCC-9?18&*B
M8U=3:? @CB R-FY"U9B6T#>J6<I&!"ZF,>5B59C?$.;OKWSR48KD5,H(U$SM
M?SXXTV0:FDSC4ND["6]K) /#,=$YTEJN#WIK1'*6"XC9FHKVEV5;8>RI.RVI
MCWDZ5"-]T0'B5T[4B*4P\#]%)'FXSMR,J9X)%H+4RSM'YDES?[9AH]&N0'D"
MTH5T=Q40I!@%\&9"+_47O@KR:6NI8<O,R>"F7-'?+\YF1[ @ ";]Y.PO/"\M
M<WN@G^#G9R8_0;J@K28P]VC*:2Y#AJSSV=C @' ULN/N@/R(=0KJNIP'EK_,
MJ:Z::HM"+K04R/-6RGLGG)5">=":8R-3B Y*BEAS+!1?970'ACCDH5GHDQXE
M<N>%V"MPW=9S)+*<B?Y*Y7YB?3'\66%[[=4RW07&L?P5'KCRC11\(YWZQJD'
ME[3/5# J7?%,5)QQR+:_3(EW J[BXB.HY2Q5P!>#KA0N9EY$*24>281<R%)_
MAVU+H;-K/DW2=)ZHXUMW59KWI8CCK\(L<TUF]X)DP7U&.O-_EBSLZ1V,ABD,
MRS\>GYY]>$_&$81=?6-M ,8OQGKC]R"6KADRTZ#S""("<"L0ELEX!+.=(D(S
M["QS<U]/WR1>R/I9R#)(>?.'#:W9>DX?ZTNZ7;M57K)#H;?]+J.B;?_3Q,T]
MY<=KKV8:;O-_,HOYV]*@+>X_/HWJ+JDYY9B1B]6VNH8.)(.JD*EY?;;W9N^P
MP8X.&^9.?*.\']\PE^7_"U!+ 0(4 PH    ( *P<DSCJ"_^^BPD  #,_   2
M              "D@0    !E>&5C=71I;VY?;&]G+FAT;6Q02P4&      $ 
, 0!     NPD      
end


Mime
View raw message