harmony-alerts mailing list archives

Site index · List index
Message view « Date » · « Thread »
Top « Date » · « Thread »
From nom...@intel.com
Subject [build-test alert] FAILED Linux x86_64: jdktools-test debug
Date Fri, 18 Apr 2008 20:53:57 GMT

BUILD FAILED:
	Ant Error Message:
/export/users/cc/cc-common/scripts/cc-exec-adaptor.xml:104: The following error occurred while
executing this line: /export/users/cc/cc-common/adaptors/jdktools-test/adaptor.xml:24: The
following error occurred while executing this line: /export/users/cc/cc-common/build/checkouts/hdk/working_jdktools/build.xml:242:
The following error occurred while executing this line: /export/users/cc/cc-common/build/checkouts/hdk/working_jdktools/make/build-test.xml:60:
The following error occurred while executing this line: /export/users/cc/cc-common/build/checkouts/hdk/working_jdktools/make/properties.xml:336:
The following error occurred while executing this line: /export/users/cc/cc-common/build/checkouts/hdk/working_jdktools/modules/samsa/build.xml:151:
exec returned: 1

Date of build:	2008-04-19 03:36:26 +0700
Time to build:	17 minutes 24 seconds
Last changed:	04/18/2008 23:50:25
Last log entry:	hdk

***********************************************************
Errors/Warnings:	(57)
            
========================================
Testing jdktools binaries...
========================================
Compiling JPDA tests
Since fork is false, ignoring memoryMaximumSize setting
----------
1. WARNING in /export/users/cc/cc-common/build/checkouts/hdk/working_jdktools/modules/jpda/src/test/java/org/apache/harmony/jpda/tests/framework/TestOptions.java
(at line 505)
internalProperties.put(name, value);
^^^^^^^^^^^^^^^^^^^^^^^^^^^^^^^^^^^
Type safety: The method put(Object, Object) belongs to the raw type HashMap. References to
generic type HashMap<K,V> should be parameterized
----------
1 problem (1 warning)
JPDA exclude list: /export/users/cc/cc-common/build/checkouts/hdk/working_classlib/deploy/build/jdktools.jpda.exclude
Running JPDA tests
Debugger JVM=/export/users/cc/cc-common/build/checkouts/hdk/target/hdk/jdk/jre/bin/java
Debuggee JVM=/export/users/cc/cc-common/build/checkouts/hdk/target/hdk/jdk/jre/bin/java
SAMSA exclude list: /export/users/cc/cc-common/build/checkouts/hdk/working_classlib/deploy/build/jdktools.samsa.exclude
Running SAMSA tests
test.jre.home=/export/users/cc/cc-common/build/checkouts/hdk/target/hdk/jdk/jre
Run jdk/bin/java -version in /export/users/cc/cc-common/build/checkouts/hdk/working_jdktools/build/test_report
Run jdk/bin/javac -version in /export/users/cc/cc-common/build/checkouts/hdk/working_jdktools/build/test_report
java.lang.reflect.InvocationTargetException
at java.lang.reflect.VMReflection.newClassInstance(VMReflection.java)
at java.lang.reflect.Constructor.newInstance(Constructor.java:283)
at org.apache.harmony.tools.javac.Compiler.initializeInstance(Compiler.java:121)
at org.apache.harmony.tools.javac.Compiler.initialize(Compiler.java:100)
at org.apache.harmony.tools.javac.Compiler.<init>(Compiler.java:91)
at org.apache.harmony.tools.javac.Compiler.main(Compiler.java:55)
at org.apache.harmony.tools.javac.Main.compile(Main.java:78)
at org.apache.harmony.tools.javac.Main.compile(Main.java:52)
at org.apache.harmony.tools.javac.Main.main(Main.java:33)
Caused by: java.lang.VerifyError: org/eclipse/jdt/internal/compiler/impl/CompilerOptions/optionKeyFromIrritant(J)Ljava/lang/String;,
pass: 1, instr: 11, reason: compound instruction: method length is less than required
at java.lang.ClassLoader.defineClass0(ClassLoader.java)
at java.lang.ClassLoader.defineClass(ClassLoader.java:438)
at java.security.SecureClassLoader.defineClass(SecureClassLoader.java:70)
at java.net.URLClassLoader.access$3(URLClassLoader.java:1)
at java.net.URLClassLoader$URLJarHandler.createClass(URLClassLoader.java:437)
at java.net.URLClassLoader$URLJarHandler.findClass(URLClassLoader.java:367)
at java.net.URLClassLoader.findClassImpl(URLClassLoader.java:1193)
at java.net.URLClassLoader$4.run(URLClassLoader.java:888)
at java.net.URLClassLoader$4.run(URLClassLoader.java:1)
at java.security.AccessController.doPrivilegedImpl(AccessController.java:171)
at java.security.AccessController.doPrivileged(AccessController.java:64)
at java.net.URLClassLoader.findClass(URLClassLoader.java:885)
at java.lang.ClassLoader.loadClass(ClassLoader.java:593)
at java.lang.ClassLoader.loadClass(ClassLoader.java:319)
at org.eclipse.jdt.internal.compiler.batch.Main.initialize(Main.java:3297)
at org.eclipse.jdt.internal.compiler.batch.Main.<init>(Main.java:1388)
at org.eclipse.jdt.internal.compiler.batch.Main.<init>(Main.java:1384)
at java.lang.reflect.VMReflection.newClassInstance(VMReflection.java)
... 8 more
Uncaught exception in main:
java.lang.NullPointerException
at org.apache.harmony.tools.javac.Compiler.main(Compiler.java:60)
at org.apache.harmony.tools.javac.Main.compile(Main.java:78)
at org.apache.harmony.tools.javac.Main.compile(Main.java:52)
at org.apache.harmony.tools.javac.Main.main(Main.java:33)
The execution FAILED with the following exception:
The following error occurred while executing this line:
/export/users/cc/cc-common/adaptors/jdktools-test/adaptor.xml:24: The following error occurred
while executing this line:
/export/users/cc/cc-common/build/checkouts/hdk/working_jdktools/build.xml:242: The following
error occurred while executing this line:
/export/users/cc/cc-common/build/checkouts/hdk/working_jdktools/make/build-test.xml:60: The
following error occurred while executing this line:
/export/users/cc/cc-common/build/checkouts/hdk/working_jdktools/make/properties.xml:336: The
following error occurred while executing this line:
/export/users/cc/cc-common/build/checkouts/hdk/working_jdktools/modules/samsa/build.xml:151:
exec returned: 1

***********************************************************
Unit Tests: (155)
        
All Tests Passed

***********************************************************
Modifications since last successful build:	(1)
            
add cc-hdk log20080418235025Lbuild.789 04/18/2008 23:50:25hdk

begin 644 execution_log.zip
M4$L#! H    ( +H>DS@.H<Z+J D  !T_   2    97AE8W5T:6]N7VQO9RYH
M=&ULU5MM;]NV%OX\_PIBV,42P*:L=UE- P1INZ9+NB#)L@]#[T!+M*U$%G4I
M*HGWZ^\A92=Q8JMV<M9B1HO8(OGP\+R3.MR;J&F^OS<4Z6Q_KY1\?X^12LUR
M_O;GD2A4K\K^YC&)^O]Y\_-^IRY3IGBONBGB3J=7<567O:OT6@F15[W;2C^<
M=UE^*FL8\*XN\RR!QI244ESQ1)&"33G)"I)-2R$5):?SYQ>B[!WS&Y[KGB67
M:D92/LJ*3&6BJ)KO #/*9*7T>(O?:0"KKKBLK"2!?[U$3*>BL*I$9J6JK#E0
MQBMZ-\T)*U+"QDS/W3I\6&=Y:B43GER+&F FZ;5U*^1U5HS_6JS1FK)K_F2"
M3D?Q2L4=HC]_\F0BOI#.VPT_G0L8"S.0Q0QDF!5,:FA*-T?I)#EG14\34O6 
M^K(&@CJ)*&>]*\E[HRSG6CC)9"K2Y2?S+G&SBAZTUZ;%+&9ZG6;R"SF4W,@2
M?L2OYF#324_VE^0:Z5M,574ZYD?#H659'8IIF>5:!I].WQV0IONWH,E*<E95
M?#[9%;MAR6-JG- FE:AEPHF1%E'B'Y_]/"OT=#",9!49L;SB79*-"R$U15,^
M%7)VPNZR:3T]!V]!P"]H[5W"Z-U_EA[;E/QQ</;YZ/,O*';8Z*EU!3[(JF1B
MUF3IJ2PAQQ8K&0!8$R8!<=;T:E8]DN"(-)RE+>^WTK@9J@<N44MVF"(@!D[\
MOK^[U/1#5B@N"Y:?/K@!L+<=[>&ZY(;E-=]]LSSBOU__+ VXF)7 6S;B:A:3
MBPD'SJN) &<*T_PVU'ZS2YJ_NV3(<U&,C78HZ"G9+5%Z^$=634Y82<D9'W')
M0:ZFSY@77&;)4I^]7[N7^Z2:B#I/ 8^43#,)%@DB3C>2K7;>PYQ/R8Y-;IDL
M0%:[G0[$&(#B/7Z7Y'7*E\W.&-N\!3@-'O2E2F$4.<^&5LK+7,SF?1>J0K7P
MZ7PB$Y]6.8&SNBA6N(!%,R'O^+ >C[DDGRY/WFY)J&)RS)7Y>J7_2VZ!E[?N
ME>[9+/R?F.7/JQJBZL-2P4YH8R=T;B<-J\SJZ55Z6]++3*J:Y2?0"4R!7@(=
M8"[:<)80]8.*Z,A/["[YP+*\EA!#2+]+WDLI9//U(H,,@.>LK'@:DY &@0_^
M(WDUDDL'88"$% 8V$E)_X*$@>=2-L&@*^S@<]ZAO1TA(_7XKG]Q-D6R;AH-!
M&Y2SN6I&#L[R@.6^BX(44,=N%=XVC H"IPW*VQ3* =-#4G.7!NW2VP+)'^"X
M S ]))I\,+U6I&!CE@^H[89(:NY%6&H>.3AJ$ &CT$PO0HL*:!XX\EK58&/+
MLWWJN:U&O#%1#@V\5H7:!LG'00)O$&&%3]_!4H/(P?'E#O4C'-EIU41#&N 9
M'H[7A.0 +_5!HLD!)*RT-0RQ'+F-E  #QT,<?=*)'5:RV7?0.&[C6# @N6A(
M 5;>$Z+Q"<N/.S2RT2("VM8L0-LN!@.LU87MB<%WV'& I_/0O"^>!8<X>8'.
M5="L)4#+GT*T1--&0T+*>K17P8K!B+)#VW4& 9;=82%YM#VEV_C( /;YCHN5
MTWE(/M.G-DZJ$E(?S=%%:,<AD8^6CH=8QA+UL5S!P$%+,^W68.YO<;#B(L8[
M-"U .X]&<N,1]9$2#%OO.7&69^-IN8'"HVJ =N+>GOAL<^KG86D"4H[AHYV'
M0,1KWU-O83!?8=,6#'?;7Y9LC!10M_TL:_-W !YUT/9E2*X<\I[V-QQ;[?#0
M]HIHF6:(M$L FI 2'YMZ =9.V&Y_O['5ZM"B,!(2.%\DE^F"I\,ZJ;/13LAM
M) O6ON Y32\O-_@H\O3]#2]4A5)Q )D+TA%2$$!TP+'FD#HVUCM&%VG+ !'+
M16(4]=#>I&/%F0 RH '6SM%%TBB@"6EUD"0@';P#HURDE[$!=9"0/+2W^X%.
M$PQ21XDZF?1&\V&F-C9>/.5F_/TS?E\C&W^EONW\X.3\VQ2X56Q:/52X:0H2
M420,^/)9  %94V#<U)#J8NA"D +6P5.B^)WJDE3H]D*HB2[E_%J%7+,NTV&I
M73^A5Q*\NYCRU]>N/9U;%TC?U[.1WDU3BH912KJZ(!FFON/)%W)@0A;YV(0L
M<LSJ GY+$I.=9)<<BG(FL_%$$7LP -5S^J#GNF!S/NQ<C-0MJ CY(.HB9;K8
M% (AR4!;\RSA106ZU24,Y%*:BOEASNG2]&:UB\7^:%.?]G\D2SU "7LL+R<,
M2 (9$EAZF7/%]3SZ.TP*J$M#JIN"O"4R\ 9^!':Q<U!* GL43?QNEQQG17UG
M\6G@*6N<)#I!H- KU:6)Q#!K"6RB5!E;BU+;18B':-\JP>0;BE#/1W-6C*GD
MHYPGBAX5-R(QTK@PBO?^+N&F$GAIW ],K1A[>7+6?(/NM."WA]HXCXI*L2+A
M.TNM>O#N!I"' H;+.E%":L1[L,?/]:C8B=SG>"L2JWGAJ^8S;0K*N:3F3@7+
ML[_YHPGF;0;==FP,]*>H_?[+4?<T[/X3Q,$KR)RRK'@"Y_M;PYT "DT:E!WS
MPR"%$1:2[[P,R2SO <9]HBZ'#"PL)<-9_$@++[G,1C,3)V,]B<63/(,8"9Y8
M68M:=VM.H[0R<"_6@H/S^GE+F+^_\MD'*:9'4F:@7VKGT^ZQJ<C7TUCG2M\A
M>-,E)=B+B=.9UFY=D-@EDK-*0/36LVA/V;35QHSB1?5[SHNQFNB+"1#)*J(F
MK("!_ZLSR=,6*S,&>BQ8"@)OKA.9)_V=QPU?,]4U(,\P8L]=H00&!U*-&A@S
MH^?Z"U^'^+RUT:T55F1@"Z[H[V?'CP>P) $&_>3N/'G>V./&.#_!ST],?H2<
M01M+8J[!-$2N O;<\*70L/IT/; ;; [\ '4$>KJ: ?9@A1==1ZA'(1]:B1-%
MZR2]%<PZ>=RKRX&1)L0")46NN96*4YG=@/F->6I6^:Q' QR^#GH-;."]0!AK
M&+C"\ZXVN1S^K#$X?ZTTMT%Q[<%JCSMWAA2<(5TXPX7#EG3(5#)I7.^C /C(
M 3N#%;J[%>X\!#Y@VNXJQ7LUYCJQ(B8_E%(2D:F0R^GH[[!9J74.S1=IF,X)
M=2B+U^1QG^L\/Q5FB>M3MU>D!,'V*<N_*27HZ!V*1JD-LS\<'!V_?T=N,PBN
M^@K9"*Q=W.J]WKU 8C/D48/.%HA(P(] \"6W$Z!U@0C-L).LS.VYN-.2VK.4
ME9#:5O<[6;/M7#S65VMCQVONOR'/O/FF8DZ%\_W(,#>.'RZO&H*"_G>F9_D&
M-"A5\!T)FE\%-<<@CZ1F^W9L9H0D4=6R,*\\.GL6V]^SS.UWJ[D);YEK\?\'
M4$L! A0#"@    @ NAZ3. ZASHNH"0  '3\  !(              *2!    
I &5X96-U=&EO;E]L;V<N:'1M;%!+!08      0 ! $    #8"0     ! 
end


Mime
View raw message