harmony-alerts mailing list archives

Site index · List index
Message view « Date » · « Thread »
Top « Date » · « Thread »
From nom...@intel.com
Subject [build-test alert] FAILED Linux x86: drlvm-test debug
Date Thu, 17 Apr 2008 17:47:20 GMT

BUILD FAILED:
	Ant Error Message:
/export/users/cc/cc-common/scripts/cc-exec-adaptor.xml:104: The following error occurred while
executing this line: /export/users/cc/cc-common/adaptors/drlvm-test/adaptor.xml:70: There
were drlvm-test failures

Date of build:	2008-04-18 00:44:39 +0700
Time to build:	2 minutes 34 seconds
Last changed:	04/17/2008 22:57:49
Last log entry:	hdk

***********************************************************
Errors/Warnings:	(91)
            
[cc] In file included from /export/users/cc/cc-common/build/checkouts/hdk/working_vm/vm/tests/unit/thread/test_java_suspend.c:20:
[cc] /export/users/cc/cc-common/build/checkouts/hdk/working_vm/vm/tests/unit/thread/utils/thread_unit_test_utils.h:21:26:
error: open/jthread.h: No such file or directory
[cc] /export/users/cc/cc-common/build/checkouts/hdk/working_vm/vm/tests/unit/thread/test_java_suspend.c:21:26:
error: open/jthread.h: No such file or directory
[cc] In file included from /export/users/cc/cc-common/build/checkouts/hdk/working_vm/vm/tests/unit/thread/test_stress_suspend.h:26,
[cc]                  from /export/users/cc/cc-common/build/checkouts/hdk/working_vm/vm/tests/unit/thread/test_stress_suspend_4.c:71:
[cc] /export/users/cc/cc-common/build/checkouts/hdk/working_vm/vm/tests/unit/thread/utils/thread_unit_test_utils.h:21:26:
error: open/jthread.h: No such file or directory
[cc] In file included from /export/users/cc/cc-common/build/checkouts/hdk/working_vm/vm/tests/unit/thread/utils/thread_unit_test_utils.c:21:
[cc] /export/users/cc/cc-common/build/checkouts/hdk/working_vm/vm/tests/unit/thread/utils/thread_unit_test_utils.h:21:26:
error: open/jthread.h: No such file or directory
[cc] /export/users/cc/cc-common/build/checkouts/hdk/working_vm/vm/tests/unit/thread/utils/thread_unit_test_utils.c:25:28:
error: open/ti_thread.h: No such file or directory
[cc] In file included from /export/users/cc/cc-common/build/checkouts/hdk/working_vm/vm/tests/unit/thread/test_java_park.c:20:
[cc] /export/users/cc/cc-common/build/checkouts/hdk/working_vm/vm/tests/unit/thread/utils/thread_unit_test_utils.h:21:26:
error: open/jthread.h: No such file or directory
[cc] /export/users/cc/cc-common/build/checkouts/hdk/working_vm/vm/tests/unit/thread/test_java_park.c:21:26:
error: open/jthread.h: No such file or directory
[cc] In file included from /export/users/cc/cc-common/build/checkouts/hdk/working_vm/vm/tests/unit/thread/test_ti_monitor_info.c:21:
[cc] /export/users/cc/cc-common/build/checkouts/hdk/working_vm/vm/tests/unit/thread/utils/thread_unit_test_utils.h:21:26:
error: open/jthread.h: No such file or directory
[cc] /export/users/cc/cc-common/build/checkouts/hdk/working_vm/vm/tests/unit/thread/test_ti_monitor_info.c:22:26:
error: open/jthread.h: No such file or directory
[cc] /export/users/cc/cc-common/build/checkouts/hdk/working_vm/vm/tests/unit/thread/test_ti_monitor_info.c:24:28:
error: open/ti_thread.h: No such file or directory
[cc] In file included from /export/users/cc/cc-common/build/checkouts/hdk/working_vm/vm/tests/unit/thread/test_stress_suspend.h:26,
[cc]                  from /export/users/cc/cc-common/build/checkouts/hdk/working_vm/vm/tests/unit/thread/test_stress_suspend_5.c:71:
[cc] /export/users/cc/cc-common/build/checkouts/hdk/working_vm/vm/tests/unit/thread/utils/thread_unit_test_utils.h:21:26:
error: open/jthread.h: No such file or directory
[cc] In file included from /export/users/cc/cc-common/build/checkouts/hdk/working_vm/vm/tests/unit/thread/utils/thread_util_platform_dependent.c:19:
[cc] /export/users/cc/cc-common/build/checkouts/hdk/working_vm/vm/tests/unit/thread/utils/thread_unit_test_utils.h:21:26:
error: open/jthread.h: No such file or directory
[cc] In file included from /export/users/cc/cc-common/build/checkouts/hdk/working_vm/vm/tests/unit/thread/test_stress_suspend.h:26,
[cc]                  from /export/users/cc/cc-common/build/checkouts/hdk/working_vm/vm/tests/unit/thread/test_stress_suspend_6.c:68:
[cc] /export/users/cc/cc-common/build/checkouts/hdk/working_vm/vm/tests/unit/thread/utils/thread_unit_test_utils.h:21:26:
error: open/jthread.h: No such file or directory
[cc] In file included from /export/users/cc/cc-common/build/checkouts/hdk/working_vm/vm/tests/unit/thread/test_ti_peak_count.c:21:
[cc] /export/users/cc/cc-common/build/checkouts/hdk/working_vm/vm/tests/unit/thread/utils/thread_unit_test_utils.h:21:26:
error: open/jthread.h: No such file or directory
[cc] /export/users/cc/cc-common/build/checkouts/hdk/working_vm/vm/tests/unit/thread/test_ti_peak_count.c:22:26:
error: open/jthread.h: No such file or directory
[cc] /export/users/cc/cc-common/build/checkouts/hdk/working_vm/vm/tests/unit/thread/test_ti_peak_count.c:24:28:
error: open/ti_thread.h: No such file or directory
[cc] In file included from /export/users/cc/cc-common/build/checkouts/hdk/working_vm/vm/tests/unit/thread/test_native_suspend.c:21:
[cc] /export/users/cc/cc-common/build/checkouts/hdk/working_vm/vm/tests/unit/thread/utils/thread_unit_test_utils.h:21:26:
error: open/jthread.h: No such file or directory
[cc] In file included from /export/users/cc/cc-common/build/checkouts/hdk/working_vm/vm/tests/unit/thread/test_java_identify.c:20:
[cc] /export/users/cc/cc-common/build/checkouts/hdk/working_vm/vm/tests/unit/thread/utils/thread_unit_test_utils.h:21:26:
error: open/jthread.h: No such file or directory
[cc] /export/users/cc/cc-common/build/checkouts/hdk/working_vm/vm/tests/unit/thread/test_java_identify.c:21:26:
error: open/jthread.h: No such file or directory
[cc] In file included from /export/users/cc/cc-common/build/checkouts/hdk/working_vm/vm/tests/unit/thread/test_ti_timing.c:21:
[cc] /export/users/cc/cc-common/build/checkouts/hdk/working_vm/vm/tests/unit/thread/utils/thread_unit_test_utils.h:21:26:
error: open/jthread.h: No such file or directory
[cc] /export/users/cc/cc-common/build/checkouts/hdk/working_vm/vm/tests/unit/thread/test_ti_timing.c:22:26:
error: open/jthread.h: No such file or directory
[cc] /export/users/cc/cc-common/build/checkouts/hdk/working_vm/vm/tests/unit/thread/test_ti_timing.c:24:28:
error: open/ti_thread.h: No such file or directory
[cc] In file included from /export/users/cc/cc-common/build/checkouts/hdk/working_vm/vm/tests/unit/thread/test_ti_raw_monitors.c:20:
[cc] /export/users/cc/cc-common/build/checkouts/hdk/working_vm/vm/tests/unit/thread/utils/thread_unit_test_utils.h:21:26:
error: open/jthread.h: No such file or directory
[cc] /export/users/cc/cc-common/build/checkouts/hdk/working_vm/vm/tests/unit/thread/test_ti_raw_monitors.c:21:26:
error: open/jthread.h: No such file or directory
[cc] /export/users/cc/cc-common/build/checkouts/hdk/working_vm/vm/tests/unit/thread/test_ti_raw_monitors.c:22:28:
error: open/ti_thread.h: No such file or directory
[cc] /export/users/cc/cc-common/build/checkouts/hdk/working_vm/vm/tests/unit/thread/test_ti_local_storage.c:18:28:
error: open/ti_thread.h: No such file or directory
[cc] In file included from /export/users/cc/cc-common/build/checkouts/hdk/working_vm/vm/tests/unit/thread/test_ti_local_storage.c:20:
[cc] /export/users/cc/cc-common/build/checkouts/hdk/working_vm/vm/tests/unit/thread/utils/thread_unit_test_utils.h:21:26:
error: open/jthread.h: No such file or directory
[cc] In file included from /export/users/cc/cc-common/build/checkouts/hdk/working_vm/vm/tests/unit/thread/test_java_attrs.c:21:
[cc] /export/users/cc/cc-common/build/checkouts/hdk/working_vm/vm/tests/unit/thread/utils/thread_unit_test_utils.h:21:26:
error: open/jthread.h: No such file or directory
[cc] /export/users/cc/cc-common/build/checkouts/hdk/working_vm/vm/tests/unit/thread/test_java_attrs.c:22:26:
error: open/jthread.h: No such file or directory
[cc] /export/users/cc/cc-common/build/checkouts/hdk/working_vm/vm/tests/unit/thread/test_java_attrs.c:23:28:
error: open/ti_thread.h: No such file or directory
[cc] In file included from /export/users/cc/cc-common/build/checkouts/hdk/working_vm/vm/tests/unit/thread/test_java_interrupt.c:20:
[cc] /export/users/cc/cc-common/build/checkouts/hdk/working_vm/vm/tests/unit/thread/utils/thread_unit_test_utils.h:21:26:
error: open/jthread.h: No such file or directory
[cc] /export/users/cc/cc-common/build/checkouts/hdk/working_vm/vm/tests/unit/thread/test_java_interrupt.c:21:26:
error: open/jthread.h: No such file or directory
[cc] In file included from /export/users/cc/cc-common/build/checkouts/hdk/working_vm/vm/tests/unit/thread/test_java_ptr_conv.c:20:
[cc] /export/users/cc/cc-common/build/checkouts/hdk/working_vm/vm/tests/unit/thread/utils/thread_unit_test_utils.h:21:26:
error: open/jthread.h: No such file or directory
[cc] /export/users/cc/cc-common/build/checkouts/hdk/working_vm/vm/tests/unit/thread/test_java_ptr_conv.c:21:26:
error: open/jthread.h: No such file or directory
[cc] In file included from /export/users/cc/cc-common/build/checkouts/hdk/working_vm/vm/tests/unit/thread/test_ti_state.c:21:
[cc] /export/users/cc/cc-common/build/checkouts/hdk/working_vm/vm/tests/unit/thread/utils/thread_unit_test_utils.h:21:26:
error: open/jthread.h: No such file or directory
[cc] /export/users/cc/cc-common/build/checkouts/hdk/working_vm/vm/tests/unit/thread/test_ti_state.c:22:26:
error: open/jthread.h: No such file or directory
[cc] /export/users/cc/cc-common/build/checkouts/hdk/working_vm/vm/tests/unit/thread/test_ti_state.c:24:28:
error: open/ti_thread.h: No such file or directory
[cc] In file included from /export/users/cc/cc-common/build/checkouts/hdk/working_vm/vm/tests/unit/thread/test_ti_instrum.c:20:
[cc] /export/users/cc/cc-common/build/checkouts/hdk/working_vm/vm/tests/unit/thread/utils/thread_unit_test_utils.h:21:26:
error: open/jthread.h: No such file or directory
[cc] /export/users/cc/cc-common/build/checkouts/hdk/working_vm/vm/tests/unit/thread/test_ti_instrum.c:21:26:
error: open/jthread.h: No such file or directory
[cc] /export/users/cc/cc-common/build/checkouts/hdk/working_vm/vm/tests/unit/thread/test_ti_instrum.c:22:28:
error: open/ti_thread.h: No such file or directory
[cc] In file included from /export/users/cc/cc-common/build/checkouts/hdk/working_vm/vm/tests/unit/thread/test_native_basic.c:20:
[cc] /export/users/cc/cc-common/build/checkouts/hdk/working_vm/vm/tests/unit/thread/utils/thread_unit_test_utils.h:21:26:
error: open/jthread.h: No such file or directory
[cc] In file included from /export/users/cc/cc-common/build/checkouts/hdk/working_vm/vm/tests/unit/thread/test_native_fat_monitor.c:21:
[cc] /export/users/cc/cc-common/build/checkouts/hdk/working_vm/vm/tests/unit/thread/utils/thread_unit_test_utils.h:21:26:
error: open/jthread.h: No such file or directory
[cc] In file included from /export/users/cc/cc-common/build/checkouts/hdk/working_vm/vm/tests/unit/thread/test_java_monitors.c:20:
[cc] /export/users/cc/cc-common/build/checkouts/hdk/working_vm/vm/tests/unit/thread/utils/thread_unit_test_utils.h:21:26:
error: open/jthread.h: No such file or directory
[cc] /export/users/cc/cc-common/build/checkouts/hdk/working_vm/vm/tests/unit/thread/test_java_monitors.c:21:26:
error: open/jthread.h: No such file or directory
[cc] In file included from /export/users/cc/cc-common/build/checkouts/hdk/working_vm/vm/tests/unit/thread/test_stress_suspend.h:26,
[cc]                  from /export/users/cc/cc-common/build/checkouts/hdk/working_vm/vm/tests/unit/thread/test_stress_suspend_1.c:68:
[cc] /export/users/cc/cc-common/build/checkouts/hdk/working_vm/vm/tests/unit/thread/utils/thread_unit_test_utils.h:21:26:
error: open/jthread.h: No such file or directory
[cc] In file included from /export/users/cc/cc-common/build/checkouts/hdk/working_vm/vm/tests/unit/thread/utils/thread_unit_test_main.c:21:
[cc] /export/users/cc/cc-common/build/checkouts/hdk/working_vm/vm/tests/unit/thread/utils/thread_unit_test_utils.h:21:26:
error: open/jthread.h: No such file or directory
[cc] In file included from /export/users/cc/cc-common/build/checkouts/hdk/working_vm/vm/tests/unit/thread/test_stress_suspend.h:26,
[cc]                  from /export/users/cc/cc-common/build/checkouts/hdk/working_vm/vm/tests/unit/thread/test_stress_suspend_2.c:68:
[cc] /export/users/cc/cc-common/build/checkouts/hdk/working_vm/vm/tests/unit/thread/utils/thread_unit_test_utils.h:21:26:
error: open/jthread.h: No such file or directory
[cc] In file included from /export/users/cc/cc-common/build/checkouts/hdk/working_vm/vm/tests/unit/thread/test_java_basic.c:20:
[cc] /export/users/cc/cc-common/build/checkouts/hdk/working_vm/vm/tests/unit/thread/utils/thread_unit_test_utils.h:21:26:
error: open/jthread.h: No such file or directory
[cc] /export/users/cc/cc-common/build/checkouts/hdk/working_vm/vm/tests/unit/thread/test_java_basic.c:21:26:
error: open/jthread.h: No such file or directory
[cc] In file included from /export/users/cc/cc-common/build/checkouts/hdk/working_vm/vm/tests/unit/thread/test_stress_suspend.h:26,
[cc]                  from /export/users/cc/cc-common/build/checkouts/hdk/working_vm/vm/tests/unit/thread/test_stress_suspend_3.c:71:
[cc] /export/users/cc/cc-common/build/checkouts/hdk/working_vm/vm/tests/unit/thread/utils/thread_unit_test_utils.h:21:26:
error: open/jthread.h: No such file or directory
[cc] In file included from /export/users/cc/cc-common/build/checkouts/hdk/working_vm/vm/tests/unit/thread/test_native_thin_monitor.c:21:
[cc] /export/users/cc/cc-common/build/checkouts/hdk/working_vm/vm/tests/unit/thread/utils/thread_unit_test_utils.h:21:26:
error: open/jthread.h: No such file or directory
BUILD FAILED
/export/users/cc/cc-common/build/checkouts/hdk/working_vm/build.xml:321: The following error
occurred while executing this line:
/export/users/cc/cc-common/build/checkouts/hdk/working_vm/make/tests/cunit-test.xml:62: gcc
failed with return code 1
Total time: 2 minutes 28 seconds
The execution FAILED with the following exception:
The following error occurred while executing this line:
/export/users/cc/cc-common/adaptors/drlvm-test/adaptor.xml:70: There were drlvm-test failures

***********************************************************
Unit Tests: (29)
        
All Tests Passed

***********************************************************
Modifications since last successful build:	(2)
            
add cc-hdk log20080417225749Lbuild.825 04/17/2008 22:57:49hdk
add cc-hdk log20080417225749Lbuild.825 04/17/2008 22:57:49hdk

begin 644 execution_log.zip
M4$L#! H    ( .<%DCC'G&O#*0P  +'F   2    97AE8W5T:6]N7VQO9RYH
M=&UL[5UK;]LX%OV>7\'%[&(ZP%A^U$E33UN@;=*9=)OI($F['XI"D"7:9B*)
M DFY<7_]7E)^R(DMR;'L6,XUBE22^;B/PTORZDA^-5"!_^95EWNC-Z\B0=^\
M<HA4(Y^^_K7'0U63["?MD./&?_[X]<U!''F.HC4Y##L'![7D#(Y$#.>$D&\>
M]:FBW\F)_I^%??*R?4AZS*>2] 0/2)W>1ERH>BRID'77A7\UEP<!#^O=F/E>
M75 9^TK6/>$/@YJB4NEVH>5K9^A\)^]T(=U>AYCRUFW@SQ68.P$Q:Y'@46=Y
MD:0?Z@[X?*'D6%\'92X^?3U/^B/O>=AC_5@XBO%P>17S^8M+8X./\#5Y39K6
MH=6P&T?DV64<DG/F"BY'4M% DK/0M7[+;FSVX1(:\UD8WQ:KX0AW #5NCX\R
MR@]&EAM%%O@B NL**-]WW8(2N;T^E/=H-^YGUP!_$$&'3(+MH,91^V7S,$NH
MY .BA=R23'?2<WQ),VM :9^[CF_]]%DWOT8"/I!*\EBX5)LV%Z/N@+HW/ :4
M#KR;>O*5/6TAWVA_G?R7",[5ZGW]X.(&$&6[OB,EZ%?W:.3S45Z7RA%]JHC'
MQ,.[' ;CKPWR;$"3#0BQC=<7B3%W<CT,%+/T:,X8BK7(C_LLK#D0=%R(/()U
MEP^P]UI(/;AZ7*SK,2T^#3U9OW:@>JK[6M-J=%OI*Q84R=" A4S5"JH)PTTY
M\D8^AHZ3OHV"[>EIMG;CV% SSC1:RIK^YKX"WX(;P!HH("C,#YX&7F<CN#-"
MU&?H@G;UR+@["+]!4-"'+HADE-!&;9/$-./I2?%'E##7SB',-T.Z4Y9.1%H*
MWE]^2=GZX]?SJS.BZY$.>0>RWD2<A:JY>_K4LZ339RZ J 5H48X_0TZ73KSF
M64MK74(8-NL!D.?FON9.%/DC*'7#HL@,>MTX1&T]^,$,U%5<C![-%A8Y4X1)
M0H-(C1;HF.OU?WCT03@!W46?+Y?MJ7E\:HFU_7T)5WQZJ6BTBQ[/DNZI^3QE
MB[6]_O7\#)9 N^CQ99)-_-9\(MX>VR'#TW,GD4@O1'9J 2*H[B1C(;5,[KD3
M$8?IE=8N:EB_9FKI6,S=;K[._>0V<1&'J6$N22PUF-_[C(:*!-RCY./9%7GF
MT9X3^RH_D5&"2$L+@*RAEBYSE7D=PQCX3DY.WWWYLT/^I$K-(AD-ATSP %2S
M+.M^/W?J>CRD_\HK=#GNP'4BIPM14S$J2V^<#D'D\IH]IVK O5/8]8Y ;M_O
M.NZ-#ACZ&$:!CF#IY6'Z6(/DV7T4W.G@A$FG:V:0=%=&BZ)*%'4L]$))& ==
M*HB"3BET4$;[$]-WI\H7LO_]:H2'B9"'C8V)-NOC<+/J%ZEZ0@%&W'66NJ<4
M_[]+*>^Z<<0 N"PDO3AT=?IV30!O&EW3],^\?5=1>HJJW+Y\Z@C=EQKHA(B 
MQ=RLUY+T09]OU>>'Q0-PJGJI\7<2(&3LNE1*F/>)$G%IKMX0H.ZN)#(R%^6M
M(QZZ1%A]]K\"H,.84 -PNJ=G=*GW,-3+71&8!;#NZVT?^KHR]0M@<V(57<#R
MG;!O)57).G5-.C[6VZ<56@G!B:"MCG,%:DW5=;2Z8WNM4J_O\RYL* 7M44%#
MG6B&-9/9)Q=N:R+Y+"TS/?IW<Q4#+FS 4@,F/!O@$#W[C01F%;9"FP^)@?-+
MAF)SB]Y]K.@#4WP]Z.4T88T8];U5S#9N<!KA4TB  "GUW1D]%%41,YH];>Y4
MM\#I<RXOULMT:;#2@B"I.W'W+,4TG6 *-I 8YHZ]BEO[*F5D'>J2Y@H$NW']
MFOZ0YM249ON37"W8 L@ZGOZ*]GE!90P]I?1]5&BE-W^%=HYEM9 "S2)X=XBD
M, U,P/SU=V+NK'7(IRG:ZZE@]T>5 -="P*T#ETT!3L3AG@'M^1I F]9,.%M:
M"K/RM4\O+CY?V']_ML\_7YS:'R[>GI]>%L=BP(</G#(FLXVQYW@,%#?H@T?!
MS F/%1[S6[B[I\F\.X?9T3*RH^G;:NGCG<F.GH8;WOY7+_W:?K[Y]&O[!:9?
MD_W)>B.D.JFX]O/"0W'!K+?+J;*[B%P\)25!<6?\F9(R,0D/BRPN[M?2NA7W
M,;I@TRYH%Y]4JSW.,+!.IE*\QU'./8Y%[*BYDTK09.@NTF2NF;[CP*V/IU?;
M$"+7U4B,V?C6#XDQ2(RI],[LR9 DD!CS]'R.Q!@DQBRJ@<08),8@,:;:Q)A+
M!:V1UR0WQH\[_9_#QH%8]V/>2\![*V(1R3@%C8UD'"3C5) C@60<).-L!6A(
MQD$R3DYOF)%=4 C).'N9\D4R#MXSWL ]8R3C[#\3!,DXC^X").,\M<"*9!PD
MX\S(.#S:93+.YW\>EXR36?.+$97>NG[L):^G7.NUK? O<<VXQ>F!95Y^;"?>
M,]ZUP+L6>([DO-DX3[W4_>.YEPCJDDLKI8+CW#O),BN-Q\KTM5:9A1>DB+(K
M%+)"KC6*,*^*WUM=)7NPEY$%[+>#D06DHB(2%/X^:F1!FA_2_*J;\T&:'U*^
MRM^:(,WO"?H<:7Y(\UM4 VE^2/-#FE^U:7Y(N2MH;:3<(>6N@DPHI-PAY6XK
M0$/*'5+N<GK#[.B"0DBYV\OT*U+ND!FR 68(4N[VG^^%E+M'=P%2[IY:8$7*
M'5+N9L08*89+%5WZQ>2S,6+,)15#\-?D9^*V(<C#K/#(M#OP'M+ND':WL]&E
M[]JNNX/QY23YU<DDP, 5EQ(CJEX:A1PNB^7AOT3AUH(AIIR0D+>;&2$DY"$Y
MJ_R-"Q+RGJ#/D9"'A+Q%-9"0AX0\).0A(0\)>07J(R$/"7E(R*L$X)"0AX0\
M).0A(6]7LJ-(R*M>^A4)><@;V0!O! EY^\\&0T+>H[L "7E/+; B(6];A#Q7
MMVD U%E>J!;Y<9^%-2=4-9.A9]WE%*LI#/1B>45N3?*5#1M/'@LP>]VC>O<K
MZ]<.5$]U7VM:C6XK?<6"(OD:N%&D''FS@!JT>?$G?1O9V]/3;,$E57%4"P$G
M0UHS?6;XB8$OM7P12*!_A*6FR3Q9?DT$K@V#C$(&(:95YM-'IU3-\"KKO'N]
M2^)T6;@<5<9\DR2&)$X(FTF=9-%]+0J2^LQUOY/62Z*X<GQ#I)1P3+J4C)WA
M+:]V%B;,2Q8:KJ3NC =EL#"UOO4D,V*NV+IO>YRELMQ.J[%@:(V%*KG[6#%?
MCD]L_85M!#*7K4&GU>RTCCJ$"L$! ASDJU^/DW&##OF;Z\@^2*P$(QUP0O5M
MQ]&VI%]HO))%WAX*I-(A9ZH*6/_H]Z5BW?ML22R[#39^T=Q7@&[%VYDZ&03O
MJ76W;,?#3NMX7GK%[)U'QRRH10[,:S@=K&&Y*D8'HP4 %>HSD,9F88]C5%C?
M?JU*2MVN;@RKQGKF$-<SY>H$)W;D.PKV_H&=;-YU2LGM-%^BE9_&F#H";Q\=
MH[=+F \BZMS8+H_-",(UP%K6J\8*8%[F"L__2<)U/C6SI_#=\L:0Z1F5]4:X
M.5S7>I7%@8X"+-!/:^SSN-JXY:HQ)<SDK?!T ((*Y\=D@RLQ=JUOOVI*W2H;
MPQN26U,+?-C:<.'TJ=Z_'E=Z\-U59W]'WY978XY2 N_;K&>Z"LS#\P(_KVXL
M2!;!^C?B1!RIO8X$VS%?M<-7I(3M\G"(0%C7>I7% 82NY(E$G,0>;K@*3&%I
M<:N]DV2A5"(.,&:M9;K*"5SZUG'KV?"N(YF[U[#=NDE[CIKD%_9Z MORNA 3
M=659K[(XJ ;;H(EL@PWI%#@LQ)#ZA(92"X=2>5/ _B_U-F^ZRB*@&N/].9)?
MR]R)J $+]W8K,G?R[LO9IQ/RX>W9I].3N2_6?$S4N@W\SG,0EUSIERUSW^<_
M]!.?1G+S0+\0X,@? RTJO:5NG+S5:L"D>0*\4Y(P@7-#QV9.GMW5QT:XHU:'
M]%V7]!S]]"CYP=2 "*IB$1)7O_8_XSGQ*_,0JF(![9 6"5@80ZND=3Q^69^<
M*_P1_IKW;OFJ,VW4Y=%(/P@;C;36S>/9$ZVYJB8O(I-U\XL?1IV#,1Q_L@@<
MJ@OI1N&LP,.^]UNS6XW&<:/=/+8;C7;;@F8.#K0/QT[BX1@MB<74O'=O71J9
MU\@=/-3M&1([GA/IK5A*V,DUX]$7#8,V0<D/_6=6RO@X!E4/7M6=-Z_JD:#P
MM\N]$?PW4('_YO]02P$"% ,*    " #G!9(XQYQKPRD,  "QY@  $@      
M        I($     97AE8W5T:6]N7VQO9RYH=&UL4$L%!@     !  $ 0   
' %D,      $! 
end


Mime
View raw message