harmony-alerts mailing list archives

Site index · List index
Message view « Date » · « Thread »
Top « Date » · « Thread »
From nom...@intel.com
Subject [build-test alert] FAILED Linux x86_64: drlvm-test debug
Date Thu, 17 Apr 2008 17:59:06 GMT

BUILD FAILED:
	Ant Error Message:
/export/users/cc/cc-common/scripts/cc-exec-adaptor.xml:104: The following error occurred while
executing this line: /export/users/cc/cc-common/adaptors/drlvm-test/adaptor.xml:70: There
were drlvm-test failures

Date of build:	2008-04-18 00:56:59 +0700
Time to build:	2 minutes 1 second
Last changed:	04/17/2008 23:18:35
Last log entry:	hdk

***********************************************************
Errors/Warnings:	(91)
            
[cc] In file included from /export/users/cc/cc-common/build/checkouts/hdk/working_vm/vm/tests/unit/thread/test_java_suspend.c:20:
[cc] /export/users/cc/cc-common/build/checkouts/hdk/working_vm/vm/tests/unit/thread/utils/thread_unit_test_utils.h:21:26:
error: open/jthread.h: No such file or directory
[cc] /export/users/cc/cc-common/build/checkouts/hdk/working_vm/vm/tests/unit/thread/test_java_suspend.c:21:26:
error: open/jthread.h: No such file or directory
[cc] In file included from /export/users/cc/cc-common/build/checkouts/hdk/working_vm/vm/tests/unit/thread/test_stress_suspend.h:26,
[cc]                  from /export/users/cc/cc-common/build/checkouts/hdk/working_vm/vm/tests/unit/thread/test_stress_suspend_4.c:71:
[cc] /export/users/cc/cc-common/build/checkouts/hdk/working_vm/vm/tests/unit/thread/utils/thread_unit_test_utils.h:21:26:
error: open/jthread.h: No such file or directory
[cc] In file included from /export/users/cc/cc-common/build/checkouts/hdk/working_vm/vm/tests/unit/thread/utils/thread_unit_test_utils.c:21:
[cc] /export/users/cc/cc-common/build/checkouts/hdk/working_vm/vm/tests/unit/thread/utils/thread_unit_test_utils.h:21:26:
error: open/jthread.h: No such file or directory
[cc] /export/users/cc/cc-common/build/checkouts/hdk/working_vm/vm/tests/unit/thread/utils/thread_unit_test_utils.c:25:28:
error: open/ti_thread.h: No such file or directory
[cc] In file included from /export/users/cc/cc-common/build/checkouts/hdk/working_vm/vm/tests/unit/thread/test_java_park.c:20:
[cc] /export/users/cc/cc-common/build/checkouts/hdk/working_vm/vm/tests/unit/thread/utils/thread_unit_test_utils.h:21:26:
error: open/jthread.h: No such file or directory
[cc] /export/users/cc/cc-common/build/checkouts/hdk/working_vm/vm/tests/unit/thread/test_java_park.c:21:26:
error: open/jthread.h: No such file or directory
[cc] In file included from /export/users/cc/cc-common/build/checkouts/hdk/working_vm/vm/tests/unit/thread/test_ti_monitor_info.c:21:
[cc] /export/users/cc/cc-common/build/checkouts/hdk/working_vm/vm/tests/unit/thread/utils/thread_unit_test_utils.h:21:26:
error: open/jthread.h: No such file or directory
[cc] /export/users/cc/cc-common/build/checkouts/hdk/working_vm/vm/tests/unit/thread/test_ti_monitor_info.c:22:26:
error: open/jthread.h: No such file or directory
[cc] /export/users/cc/cc-common/build/checkouts/hdk/working_vm/vm/tests/unit/thread/test_ti_monitor_info.c:24:28:
error: open/ti_thread.h: No such file or directory
[cc] In file included from /export/users/cc/cc-common/build/checkouts/hdk/working_vm/vm/tests/unit/thread/test_stress_suspend.h:26,
[cc]                  from /export/users/cc/cc-common/build/checkouts/hdk/working_vm/vm/tests/unit/thread/test_stress_suspend_5.c:71:
[cc] /export/users/cc/cc-common/build/checkouts/hdk/working_vm/vm/tests/unit/thread/utils/thread_unit_test_utils.h:21:26:
error: open/jthread.h: No such file or directory
[cc] In file included from /export/users/cc/cc-common/build/checkouts/hdk/working_vm/vm/tests/unit/thread/utils/thread_util_platform_dependent.c:19:
[cc] /export/users/cc/cc-common/build/checkouts/hdk/working_vm/vm/tests/unit/thread/utils/thread_unit_test_utils.h:21:26:
error: open/jthread.h: No such file or directory
[cc] In file included from /export/users/cc/cc-common/build/checkouts/hdk/working_vm/vm/tests/unit/thread/test_stress_suspend.h:26,
[cc]                  from /export/users/cc/cc-common/build/checkouts/hdk/working_vm/vm/tests/unit/thread/test_stress_suspend_6.c:68:
[cc] /export/users/cc/cc-common/build/checkouts/hdk/working_vm/vm/tests/unit/thread/utils/thread_unit_test_utils.h:21:26:
error: open/jthread.h: No such file or directory
[cc] In file included from /export/users/cc/cc-common/build/checkouts/hdk/working_vm/vm/tests/unit/thread/test_ti_peak_count.c:21:
[cc] /export/users/cc/cc-common/build/checkouts/hdk/working_vm/vm/tests/unit/thread/utils/thread_unit_test_utils.h:21:26:
error: open/jthread.h: No such file or directory
[cc] /export/users/cc/cc-common/build/checkouts/hdk/working_vm/vm/tests/unit/thread/test_ti_peak_count.c:22:26:
error: open/jthread.h: No such file or directory
[cc] /export/users/cc/cc-common/build/checkouts/hdk/working_vm/vm/tests/unit/thread/test_ti_peak_count.c:24:28:
error: open/ti_thread.h: No such file or directory
[cc] In file included from /export/users/cc/cc-common/build/checkouts/hdk/working_vm/vm/tests/unit/thread/test_native_suspend.c:21:
[cc] /export/users/cc/cc-common/build/checkouts/hdk/working_vm/vm/tests/unit/thread/utils/thread_unit_test_utils.h:21:26:
error: open/jthread.h: No such file or directory
[cc] In file included from /export/users/cc/cc-common/build/checkouts/hdk/working_vm/vm/tests/unit/thread/test_java_identify.c:20:
[cc] /export/users/cc/cc-common/build/checkouts/hdk/working_vm/vm/tests/unit/thread/utils/thread_unit_test_utils.h:21:26:
error: open/jthread.h: No such file or directory
[cc] /export/users/cc/cc-common/build/checkouts/hdk/working_vm/vm/tests/unit/thread/test_java_identify.c:21:26:
error: open/jthread.h: No such file or directory
[cc] In file included from /export/users/cc/cc-common/build/checkouts/hdk/working_vm/vm/tests/unit/thread/test_ti_timing.c:21:
[cc] /export/users/cc/cc-common/build/checkouts/hdk/working_vm/vm/tests/unit/thread/utils/thread_unit_test_utils.h:21:26:
error: open/jthread.h: No such file or directory
[cc] /export/users/cc/cc-common/build/checkouts/hdk/working_vm/vm/tests/unit/thread/test_ti_timing.c:22:26:
error: open/jthread.h: No such file or directory
[cc] /export/users/cc/cc-common/build/checkouts/hdk/working_vm/vm/tests/unit/thread/test_ti_timing.c:24:28:
error: open/ti_thread.h: No such file or directory
[cc] In file included from /export/users/cc/cc-common/build/checkouts/hdk/working_vm/vm/tests/unit/thread/test_ti_raw_monitors.c:20:
[cc] /export/users/cc/cc-common/build/checkouts/hdk/working_vm/vm/tests/unit/thread/utils/thread_unit_test_utils.h:21:26:
error: open/jthread.h: No such file or directory
[cc] /export/users/cc/cc-common/build/checkouts/hdk/working_vm/vm/tests/unit/thread/test_ti_raw_monitors.c:21:26:
error: open/jthread.h: No such file or directory
[cc] /export/users/cc/cc-common/build/checkouts/hdk/working_vm/vm/tests/unit/thread/test_ti_raw_monitors.c:22:28:
error: open/ti_thread.h: No such file or directory
[cc] /export/users/cc/cc-common/build/checkouts/hdk/working_vm/vm/tests/unit/thread/test_ti_local_storage.c:18:28:
error: open/ti_thread.h: No such file or directory
[cc] In file included from /export/users/cc/cc-common/build/checkouts/hdk/working_vm/vm/tests/unit/thread/test_ti_local_storage.c:20:
[cc] /export/users/cc/cc-common/build/checkouts/hdk/working_vm/vm/tests/unit/thread/utils/thread_unit_test_utils.h:21:26:
error: open/jthread.h: No such file or directory
[cc] In file included from /export/users/cc/cc-common/build/checkouts/hdk/working_vm/vm/tests/unit/thread/test_java_attrs.c:21:
[cc] /export/users/cc/cc-common/build/checkouts/hdk/working_vm/vm/tests/unit/thread/utils/thread_unit_test_utils.h:21:26:
error: open/jthread.h: No such file or directory
[cc] /export/users/cc/cc-common/build/checkouts/hdk/working_vm/vm/tests/unit/thread/test_java_attrs.c:22:26:
error: open/jthread.h: No such file or directory
[cc] /export/users/cc/cc-common/build/checkouts/hdk/working_vm/vm/tests/unit/thread/test_java_attrs.c:23:28:
error: open/ti_thread.h: No such file or directory
[cc] In file included from /export/users/cc/cc-common/build/checkouts/hdk/working_vm/vm/tests/unit/thread/test_java_interrupt.c:20:
[cc] /export/users/cc/cc-common/build/checkouts/hdk/working_vm/vm/tests/unit/thread/utils/thread_unit_test_utils.h:21:26:
error: open/jthread.h: No such file or directory
[cc] /export/users/cc/cc-common/build/checkouts/hdk/working_vm/vm/tests/unit/thread/test_java_interrupt.c:21:26:
error: open/jthread.h: No such file or directory
[cc] In file included from /export/users/cc/cc-common/build/checkouts/hdk/working_vm/vm/tests/unit/thread/test_java_ptr_conv.c:20:
[cc] /export/users/cc/cc-common/build/checkouts/hdk/working_vm/vm/tests/unit/thread/utils/thread_unit_test_utils.h:21:26:
error: open/jthread.h: No such file or directory
[cc] /export/users/cc/cc-common/build/checkouts/hdk/working_vm/vm/tests/unit/thread/test_java_ptr_conv.c:21:26:
error: open/jthread.h: No such file or directory
[cc] In file included from /export/users/cc/cc-common/build/checkouts/hdk/working_vm/vm/tests/unit/thread/test_ti_state.c:21:
[cc] /export/users/cc/cc-common/build/checkouts/hdk/working_vm/vm/tests/unit/thread/utils/thread_unit_test_utils.h:21:26:
error: open/jthread.h: No such file or directory
[cc] /export/users/cc/cc-common/build/checkouts/hdk/working_vm/vm/tests/unit/thread/test_ti_state.c:22:26:
error: open/jthread.h: No such file or directory
[cc] /export/users/cc/cc-common/build/checkouts/hdk/working_vm/vm/tests/unit/thread/test_ti_state.c:24:28:
error: open/ti_thread.h: No such file or directory
[cc] In file included from /export/users/cc/cc-common/build/checkouts/hdk/working_vm/vm/tests/unit/thread/test_ti_instrum.c:20:
[cc] /export/users/cc/cc-common/build/checkouts/hdk/working_vm/vm/tests/unit/thread/utils/thread_unit_test_utils.h:21:26:
error: open/jthread.h: No such file or directory
[cc] /export/users/cc/cc-common/build/checkouts/hdk/working_vm/vm/tests/unit/thread/test_ti_instrum.c:21:26:
error: open/jthread.h: No such file or directory
[cc] /export/users/cc/cc-common/build/checkouts/hdk/working_vm/vm/tests/unit/thread/test_ti_instrum.c:22:28:
error: open/ti_thread.h: No such file or directory
[cc] In file included from /export/users/cc/cc-common/build/checkouts/hdk/working_vm/vm/tests/unit/thread/test_native_basic.c:20:
[cc] /export/users/cc/cc-common/build/checkouts/hdk/working_vm/vm/tests/unit/thread/utils/thread_unit_test_utils.h:21:26:
error: open/jthread.h: No such file or directory
[cc] In file included from /export/users/cc/cc-common/build/checkouts/hdk/working_vm/vm/tests/unit/thread/test_native_fat_monitor.c:21:
[cc] /export/users/cc/cc-common/build/checkouts/hdk/working_vm/vm/tests/unit/thread/utils/thread_unit_test_utils.h:21:26:
error: open/jthread.h: No such file or directory
[cc] In file included from /export/users/cc/cc-common/build/checkouts/hdk/working_vm/vm/tests/unit/thread/test_java_monitors.c:20:
[cc] /export/users/cc/cc-common/build/checkouts/hdk/working_vm/vm/tests/unit/thread/utils/thread_unit_test_utils.h:21:26:
error: open/jthread.h: No such file or directory
[cc] /export/users/cc/cc-common/build/checkouts/hdk/working_vm/vm/tests/unit/thread/test_java_monitors.c:21:26:
error: open/jthread.h: No such file or directory
[cc] In file included from /export/users/cc/cc-common/build/checkouts/hdk/working_vm/vm/tests/unit/thread/test_stress_suspend.h:26,
[cc]                  from /export/users/cc/cc-common/build/checkouts/hdk/working_vm/vm/tests/unit/thread/test_stress_suspend_1.c:68:
[cc] /export/users/cc/cc-common/build/checkouts/hdk/working_vm/vm/tests/unit/thread/utils/thread_unit_test_utils.h:21:26:
error: open/jthread.h: No such file or directory
[cc] In file included from /export/users/cc/cc-common/build/checkouts/hdk/working_vm/vm/tests/unit/thread/utils/thread_unit_test_main.c:21:
[cc] /export/users/cc/cc-common/build/checkouts/hdk/working_vm/vm/tests/unit/thread/utils/thread_unit_test_utils.h:21:26:
error: open/jthread.h: No such file or directory
[cc] In file included from /export/users/cc/cc-common/build/checkouts/hdk/working_vm/vm/tests/unit/thread/test_stress_suspend.h:26,
[cc]                  from /export/users/cc/cc-common/build/checkouts/hdk/working_vm/vm/tests/unit/thread/test_stress_suspend_2.c:68:
[cc] /export/users/cc/cc-common/build/checkouts/hdk/working_vm/vm/tests/unit/thread/utils/thread_unit_test_utils.h:21:26:
error: open/jthread.h: No such file or directory
[cc] In file included from /export/users/cc/cc-common/build/checkouts/hdk/working_vm/vm/tests/unit/thread/test_java_basic.c:20:
[cc] /export/users/cc/cc-common/build/checkouts/hdk/working_vm/vm/tests/unit/thread/utils/thread_unit_test_utils.h:21:26:
error: open/jthread.h: No such file or directory
[cc] /export/users/cc/cc-common/build/checkouts/hdk/working_vm/vm/tests/unit/thread/test_java_basic.c:21:26:
error: open/jthread.h: No such file or directory
[cc] In file included from /export/users/cc/cc-common/build/checkouts/hdk/working_vm/vm/tests/unit/thread/test_stress_suspend.h:26,
[cc]                  from /export/users/cc/cc-common/build/checkouts/hdk/working_vm/vm/tests/unit/thread/test_stress_suspend_3.c:71:
[cc] /export/users/cc/cc-common/build/checkouts/hdk/working_vm/vm/tests/unit/thread/utils/thread_unit_test_utils.h:21:26:
error: open/jthread.h: No such file or directory
[cc] In file included from /export/users/cc/cc-common/build/checkouts/hdk/working_vm/vm/tests/unit/thread/test_native_thin_monitor.c:21:
[cc] /export/users/cc/cc-common/build/checkouts/hdk/working_vm/vm/tests/unit/thread/utils/thread_unit_test_utils.h:21:26:
error: open/jthread.h: No such file or directory
BUILD FAILED
/export/users/cc/cc-common/build/checkouts/hdk/working_vm/build.xml:321: The following error
occurred while executing this line:
/export/users/cc/cc-common/build/checkouts/hdk/working_vm/make/tests/cunit-test.xml:62: gcc
failed with return code 1
Total time: 1 minute 56 seconds
The execution FAILED with the following exception:
The following error occurred while executing this line:
/export/users/cc/cc-common/adaptors/drlvm-test/adaptor.xml:70: There were drlvm-test failures

***********************************************************
Unit Tests: (16)
        
All Tests Passed

***********************************************************
Modifications since last successful build:	(2)
            
add cc-hdk log20080417231835Lbuild.784 04/17/2008 23:18:35hdk
add cc-hdk log20080417231835Lbuild.784 04/17/2008 23:18:35hdk

begin 644 execution_log.zip
M4$L#! H    ( &$'DCB(<#Y(+0P  /CF   2    97AE8W5T:6]N7VQO9RYH
M=&UL[5UM;]LX$OZ>7\'#WF&[P%I^:9*FWC1 VZ2[Z37;19+V/A2%($NTS402
M!9)RX_[Z&U)^D1-;DF/9L9PQBE22.9Q7#LG1(_FXKP+_Y+C#O>')<23HR;%#
MI!KZ],VO71ZJFF0_:9L<-?[SQZ\G>W'D.8K6Y"!L[^W5DC,X$C&<$T*^>=2G
MBGXGI_I_%O;(Z_T&Z3*?2M(5/"!U>A=QH>JQI$+671?^U5P>!#RL=V+F>W5!
M9>PK6?>$/PAJBDJE^X6>;YR!\YV\TXUT?VUBVEMW@3_38.8$Q*Q%@D?MQ4T2
M/M3M\]E&R;&^#LI<?OIZD? C[WG89;U8.(KQ<#&)^?S%I;'!1_B:O"%-Z\!J
MV(W7Y,55')(+Y@HNAU+10)+ST+5^R^YL^N$2.O-9&-\5HW"$VP>*NZ-#^W _
M@Z0_M-PHLL =$1A8 $G/=0L*Y79[T-ZCG;B730$N(8(.F 3S <7A_NOF02N7
M"8@6<DLRS:3K^))F4D!KG[N.;_WT62>?(HD_D$KR6+A46S<W3-T^=6]Y#(':
M]V[KR5?VI(=\H_UU^E\B.%?+\_K!Q2T$E>WZCI2@7]VCD<^'>2R5(WI4$8^)
MQ[,<!*.O3?#924#9$"2V<?P\269.;@:!8I8>TQD#LA;Y<8^%-0=2CPOY1[#.
MXF'V7LNIAUB7BU6=IL6GH2?K-PZ0I]C7FE:CTTI?L:!)A@8L9*I64$T8<<J1
MM_(I=!SS-@KN3TZSM1NEAYIQIM%2UO0W#Q7X%MQ"N($"@L(LX>G8:Z\K](P<
M]6F 0==Z?-P?BM\@->A#%Z0R>FB[[I/$.J-Y2O&G%3+7VB',/0.Z;?9.I%H8
MQ;_\DK+XQZ\7U^=$TY$V>0?BWD:<A:JYE2K5LP349RY$4PO"1CG^-(0Z=.P[
MSUI(=059V:P00*3;A\H[4>0/H=4MBR*3 '3GD,1U(@!+4%=Q,7Q*<UCD7!$F
M"0TB-9RC9J[O_^'1!^$$=$L]OUB\9^CWB3%6]OH57/'IE:+1EOH]2\!GZ/F4
M.5;V_=>+<U@=;:G?%PDW]E[S^?A\9(H,?\^<1"*]1MFVM8F@FD_&,FN1Z#,G
M(@[3Z[ M5;)^P]3"<9F[,7V3^\GMXC(.4T->DECJJ'[O,QHJ$G"/DH_GU^2%
M1[M.[*O\JD<)(BUL +*&6KK,->A-#"/A.SD]>_?ESS;YDRHUS6HT'##! U#-
MLJR'?.[1>CRD_\IK=#5BX#J1TX$,JAB5I7=.!R!R>=U>4-7GWAELCH<@M^]W
M'/=6IPU]# -!I[+TLC%]K(/DQ<,HN,?@E$FG8V:3-"NC15$EBCH6N% 2QD&'
M"J* *04&9?0_-GUGHGPA^S\D(SQ,A#QHK$VT*8^#]:I?A/240AAQUUGHGE+\
M_RZEO.O&$8/ 92'IQJ&K:[TK!O"ZHVM2)9JU[S)*3Z(JEY=/':%YJ;XNF@A8
MV$VYEJ0/^GRC/C\HGH!3Y*7FWW&"D+'K4BEAWB=*Q*6Y>DT!=7\ED5'1*&\=
M\=@EPO*S_S4$.HP)U0>G>WI&EWHS0[W<%8%9 VM>;WO Z]K0%XC-L55T \MW
MPIZ5D))5:$W5/M;[J"5Z"<&)H*W.<P6H)NHZ6MV1O9:AZ_F\ SM+0;M4T% 7
MHV'-9/;,A?L:2SXMU$R._MU<QH!S.[!4GPG/AG"(7OQ& K,*6Z+/Q^3 V25#
ML;E%[SZ6](%IOEKHY71A#1GUO67,-NIPDN%3D0 )4NJ;.'HHJB)F--O:W*EN
MCM-G7%Z,RV1IL-2"(*$=NWM:;II,, 4[2 QSSU[%K7V=,K).=4EW!9+=B+ZF
M/Z0Y,:79_B17"_8 LHZFOZ(\+ZF,@5-*WR<-K?3FK]#.L:P>4D$S+[S;1%*8
M!L;!_/5W8FZ]M<FG2;374\GNCRH%7 L#;I5P65? B3C<L4![N4*@32@3@)>6
MPJQ\[;/+R\^7]M^?[8O/EV?VA\NW%V=7Q6,QX(-'3AGCV<;8<S0&BAOTT:-@
MZH2G2H_Y/=S?TV3>K\/J:!G5T?0MMO3QUE1'S\(U;_^K5W[=?[G^\NO^*RR_
M)ON3U49(=4IQ^R\+#\4YL]XVE\KN1^3\*2E)BEOCSY24B4EX6&1Q\9!*ZU;<
MQ^B"=;O@(1)^X:1:[7&&B74\E>(]CG+N<<R#2<V<5 4I0[<1*7/#]$T';GT\
MN]Z$$+G>1FS,VG=_B(U!;$RE-V?/!B>!V)CGYW/$QB V9AX%8F,0&X/8F&IC
M8ZX4]$;>D-P</V+Z/X>-$K'F8UYBP+M+QB+B<0H:&_$XB,>I($P"\3B(Q]E(
MH"$>!_$X.=RP(CNG$>)Q=K+DBW@<O&V\AMO&B,?9?3 (XG&>W 6(QWENB17Q
M.(C'F<'C\&B;\3B?_WE:/$XFY1<C*KUS_=A+7F2YTFM>X5_BFE&/DP/+O"_9
M3KQG'&PE#K; >23G?<AY&J;N(L^\95"W7$B42I$S+RK+)!J-F,E;KC(;SRD4
M91,4LD*N-8K@KXK?85VFAK"K^05,N(7Y!:2B(A(4_CYI?D&\'^+]JEO\0;P?
M8K_*WZ,@WN\9^ASQ?HCWFT>!>#_$^R'>K]IX/\3>%;0V8N\0>U=!2!1B[Q![
MMY% 0^P=8N]RN&%U=$XCQ-[M9/D5L7<($5D#1 2Q=[L/_$+LW9.[ +%WSRVQ
M(O8.L7<SV!@I!@MU7?C%^+,V;,P5%0-PV?A7XS8AR..L\/3X.W @XN\0?[?-
M.:;GVJZ[A5GF-/DIRB3-P!67$B.J7B.%'"Z+Q?- B<*M%(E8>T)DWG:6AA"9
MARBM\G<PB,Q[ACY'9!XB\^91(#(/D7F(S$-D'B+S"M C,@^1>8C,JT3 (3(/
MD7F(S$-DWK941Q&95[WR*R+S$$"R!@ )(O-V'Q:&R+PG=P$B\YY;8D5DWJ:0
M>:[NTP10>W&C6N3'/1;6G%#53(6>=1:CK"9AH!?+2\)KDJ]LV'CR6(#9ZQ[5
MNU]9OW& /,6^UK0:G5;ZB@5-\C5PHT@Y\G8..FC]XH]Y&]GW)Z?9@DNJXJ@6
M0IP,:,WPS/ 3 U]J^2*00/\L2TV#>;+\F@A<&P09C4R$F%Z93[<!534-65GG
MG9LMDZC#PL6Q98PX+F5(XH2PI=2E%LUN7JK49Z[[G;1>$\65XQM0I81CTJ%D
MY!)O,=EYF* P66APDYH9#\I 9&I]ZTE]Q%RQ-6][5*NRW':K,6> C80JF7VL
MF"]')[;^PC8"F<M6O]UJMEN';4*%X! %'.2KWXQ*<OTV^9OK_-Y/K 3C'4*%
MZIN/PTU)/]=X)8N\N2B02B>>B2I@_</?%XKUX+,AL>Q]L/&KYJX&Z$:\G:F3
MB> =M>Z&[7C0;AW-2J^8O?71,4UJD0/S&DX'*UBNBMG!: &!"O0,I+%9V.68
M%5:W7ZN24N]7-X=58SUS@.N9<G6"$SOR'=7E(K"3+;PN++GMYFNT\O,84X?@
M[<,C]'8)\T%$G5O;Y;$90;@&6,EZU5@!S,I<X?D_*;O.EF9V-'PWO#%D>D9E
MW2%N#E>U7F7C0&<!%NAG-G9Y7*W=<M68$J;R5G@Z $&%\V.\P968NU:W7S6E
M;I4=PVN26P,,?-C:<.'TJ-Z_'E5Z\-U79W='WX978XY2 N_;K&:Z"LS#LP*_
MK&XN2!;!^B?C1!RIG<X$FS%?M=-7I(3M\G" @;"J]2H;!Y"ZDN<2<1)[O.$J
M,(6EQ:WV3I*%4HDXP)RUDNDJ)W#I6\>-5\,[CF3N3H?MQDW:==2XOK#3$]B&
MUX58J"O+>I6-@VJ@#9J(-EB33H'#0DRISV@HM7 HE3<%[/Y2;_VFJVP$5&.\
MOT3P:YD[$=5GX<YN169.WGTY_W1*/KP]_W1V.O/%BD^*6G>!WWX)XI)K_<IE
M[OO\AW[BTTAN'NL7 ASYHZ]%I7?4C9-W6_69-,^!MTL2)G!NZ<C,R1.\^M@(
M=]AJDY[KDJZCGQXE/YCJ$T%5+$+BZI?_9SPM?FT>0E4LH&W2) $+8T7)P>'H
MC7URINU'^&M>ON6K]J1/ET=#_1QL--1*-P^G#[3F:IJ\C4S6S8]_&&WV1M'X
MDT7@3]U(=PIG!1[W?=B;W6HTCAK[S2.[T3AX94$W>WO:A2,?\7 4+(G!U*QS
M[UP:F7?)[3W6ZQD2.YX3Z9U82MCQ->/05PT3;(*2'_K/M)5Q<0RJ[AW7G9/C
M>B0H_.UP;PC_]57@G_P?4$L! A0#"@    @ 80>2.(AP/D@M#   ^.8  !( 
M             *2!     &5X96-U=&EO;E]L;V<N:'1M;%!+!08      0 !
+ $    !=#      ! 
end


Mime
View raw message