harmony-alerts mailing list archives

Site index · List index
Message view « Date » · « Thread »
Top « Date » · « Thread »
From nom...@intel.com
Subject [build-test alert] FAILED Windows 2003 x86: jdktools-test debug
Date Mon, 14 Apr 2008 12:48:03 GMT

BUILD FAILED:
	Ant Error Message:
D:\cc\cc-common\scripts\cc-exec-adaptor.xml:104: The following error occurred while executing
this line: D:\cc\cc-common\adaptors\jdktools-test\adaptor.xml:24: The following error occurred
while executing this line: D:\cc\cc-common\build\checkouts\hdk\working_jdktools\build.xml:242:
The following error occurred while executing this line: D:\cc\cc-common\build\checkouts\hdk\working_jdktools\make\build-test.xml:97:
There were test errors.

Date of build:	2008-04-14 19:26:44 +0700
Time to build:	21 minutes 13 seconds
Last changed:	04/14/2008 14:46:00
Last log entry:	hdk

***********************************************************
Errors/Warnings:	(49)
            
Result: 1
[cc-ant]: Test Suite 'jdktools-test' execution. Repository updated: ${repository.updated}
[cc-ant]: Check for 'run' failure of hdk = ${hdk.parameters.run.failed}
[cc-ant]: Result: failed.superiors = '${failed.superiors}'
========================================
Testing jdktools binaries...
========================================
Compiling JPDA tests
Since fork is false, ignoring memoryMaximumSize setting
----------
1. WARNING in D:\cc\cc-common\build\checkouts\hdk\working_jdktools\modules\jpda\src\test\java\org\apache\harmony\jpda\tests\framework\TestOptions.java
(at line 505)
internalProperties.put(name, value);
^^^^^^^^^^^^^^^^^^^^^^^^^^^^^^^^^^^
Type safety: The method put(Object, Object) belongs to the raw type HashMap. References to
generic type HashMap<K,V> should be parameterized
----------
1 problem (1 warning)
JPDA exclude list: D:\cc\cc-common\build\checkouts\hdk\working_classlib\deploy\build\jdktools.jpda.exclude
Running JPDA tests
Debugger JVM=D:\cc\cc-common\build\checkouts\hdk\target\hdk\jdk\jre/bin/java
Debuggee JVM=D:\cc\cc-common\build\checkouts\hdk\target\hdk\jdk\jre/bin/java
SAMSA exclude list: D:\cc\cc-common\build\checkouts\hdk\working_classlib\deploy\build\jdktools.samsa.exclude
Running SAMSA tests
test.jre.home=D:\cc\cc-common\build\checkouts\hdk\target\hdk\jdk\jre
Run jdk/bin/java -version in D:\cc\cc-common\build\checkouts\hdk\working_jdktools\build\test_report
java version "1.5.0"
pre-alpha : not complete or compatible
svn = r647682, (Apr 14 2008), Windows/ia32/msvc 1310, debug build
http://harmony.apache.org
Run jdk/bin/javac -version in D:\cc\cc-common\build\checkouts\hdk\working_jdktools\build\test_report
Run jdk/bin/javah in D:\cc\cc-common\build\checkouts\hdk\working_jdktools\build\test_report
Run jdk/bin/javadoc in D:\cc\cc-common\build\checkouts\hdk\working_jdktools\build\test_report
Run jdk/bin/jarsigner in D:\cc\cc-common\build\checkouts\hdk\working_jdktools\build\test_report
Run jdk/bin/keytool -help in D:\cc\cc-common\build\checkouts\hdk\working_jdktools\build\test_report
Run jdk/bin/unpack200 in D:\cc\cc-common\build\checkouts\hdk\working_jdktools\build\test_report
Compiling TOOLS tests
Since fork is false, ignoring memoryMaximumSize setting
----------
1. WARNING in D:\cc\cc-common\build\checkouts\hdk\working_jdktools\modules\tools\src\test\java\org\apache\harmony\tests\tools\javah\Test\Test01.java
(at line 24)
private static final long xxx2 = 1;
^^^^
The field Test01.xxx2 is never read locally
----------
1 problem (1 warning)
TOOLS exclude list: D:\cc\cc-common\build\checkouts\hdk\working_classlib\deploy\build\jdktools.tools.exclude
Running TOOLS tests
test.jre.home=D:\cc\cc-common\build\checkouts\hdk\target\hdk\jdk\jre
The test report is in D:\cc\cc-common\build\checkouts\hdk\working_jdktools\build\test_report\html\index.html
The execution FAILED with the following exception:
The following error occurred while executing this line:
D:\cc\cc-common\adaptors\jdktools-test\adaptor.xml:24: The following error occurred while
executing this line:
D:\cc\cc-common\build\checkouts\hdk\working_jdktools\build.xml:242: The following error occurred
while executing this line:
D:\cc\cc-common\build\checkouts\hdk\working_jdktools\make\build-test.xml:97: There were test
errors.

***********************************************************
Unit Tests: (160)
        
error: testOwnedMonitors001 org.apache.harmony.jpda.tests.jdwp.ThreadReference.OwnedMonitorsTest
Unit Test Error Details:	(1)
                
Test: testOwnedMonitors001Class: org.apache.harmony.jpda.tests.jdwp.ThreadReference.OwnedMonitorsTestorg.apache.harmony.jpda.tests.framework.jdwp.exceptions.ReplyErrorCodeException:
Error 20: INVALID_OBJECT
	at org.apache.harmony.jpda.tests.framework.jdwp.VmMirror.checkReply(VmMirror.java:95)
	at org.apache.harmony.jpda.tests.framework.jdwp.VmMirror.getThreadName(VmMirror.java:699)
	at org.apache.harmony.jpda.tests.jdwp.ThreadReference.OwnedMonitorsTest.testOwnedMonitors001(OwnedMonitorsTest.java:114)
	at java.lang.reflect.VMReflection.invokeMethod(VMReflection.java)

***********************************************************
Modifications since last successful build:	(1)
            
add cc-hdk log20080414144600Lbuild.689 04/14/2008 14:46:00hdk

begin 644 execution_log.zip
M4$L#! H    (  ">CCB" Q;270T  *I-   2    97AE8W5T:6]N7VQO9RYH
M=&UL[1QK;]NV]K,#]#\<#+A8 D2*WTX\-T!NTZ[MFK:(L^Y#W1LP$FTID46-
MDN)X7?_[/8>4;$MV;*=CBN#B&ELJ43P/GC<IBCTO&0?'O2OA3H][D>3'/09Q
M,@WX\Y^'(DRLV/^+=^&P^J]??CY^MI-&+DNX%=^&W6<[SW:LF"=I9%V[-XD0
M06Q-8MV<=2NWRY3 3M,H\!U\[D(DQ35W$@C9F(,?@C^.A$QL^)BU7XC(>L=O
M>4 ](RZ3*;A\Z(=^XHLPUM>(9NC+."'XT^[ <? _RQ'CL0@'L2/]*(D'&;3/
M8_MN'  +76 C1@278:Y2/W 'CL>=&Y$BK.?>#"9"WOCAZ#(?T&#,;G@)*PTP
MX7&"(P3Z?>:.)[[ SO,M?SL7"(Q$("<"5W[()&&W[>VQ$!M.P%EH$3.QA6.(
MTD2)WQ'1U+J6W!KZ =<:<;RQ<,MM6;=N/B(+^Z3ZJ1K8^,;UY1=X(;E2(MYT
MOT^*NA.1N)2<-/]X!&(:C+K5<BEIZ8481WY TG_[\?0$,HA'8V;@!"R.>4[B
MFMTR9Y&)>J<&L4BEPT'I!1+Q2#3[?DA$$ [\&(8LB/D^^*-02.)CS,="3L_8
MG3].QWV,!( .3T9:1&+-?L7VF@U_G)R_?_/^U^]W-&UZ@VN,*(-8.FHL \(_
M$'(T8!%#! ./2<0XU;WT:(<28PJA&Y!??8A4Q+ )L,@C[+($4.@<6M767O%9
MQ0\3+D,6?)Q[.CK3+H6K?;AE0<KW?BF!_&?SKPAQ,8U0K&S(DVD7+CR.0D\\
M@;$1"7VXHC"X#_K?/;CB@0A'RAP2["G9!!("?\UB[XQ%-ISS(9<<5:KZC'C(
MI>\4^O1^V_]T#+$GTL!%?! Q$A0.$[7K;JE6BL97 1_#;@TF3(:HL3WR+TP?
MB(Y;_,X)4I>7?$QY5O8()8Z1\D$FH<PW\*\&+H\",<WZYH9BD^KM#'N6:U9Z
M^GD:AJO\/'\.<,JOTM&(2WC[Z>SY-APF3(YXHBZOZ7_)#S!T'\QM;0DW-X?[
M\W6*Z7 ^+O0*6WN%G7F%%HT:JGWM3B+[DR^3E 5GV GMWO[$98S.06Y21$DM
M,5#2AMH^O&)^D$K, E#=AY=2"JDO+WS,W3Q@4<S=+K3M=KV%4<+YYZA:=K7=
M,(;JR""JIBE4M4[=&%>=PR<HJWJ[O1958UM4M9;=JJW'5=\:5]6N'W7,&:DQ
M'=8.UW/U$&EM,JWFMK@:+;O9>I)FNL$>'H"JW3*&JGFX/CJTMY9[W:X?UHQ9
MO$G!-XTY3\M4J&G:1T='IKAJ=(REL$9SO3EL[8;UJLEL4:L:$Y8Y5$\+C;G 
MCK;9_E^5D;E0T%X?ZQ[$E+%H;M!/-I6-#PGF!@-4JV-NA US98*Y&MM@F6"R
M\F\:-'=#/HAQZO ISMUJ+8,#-*7!)QBLZE5S<UQCDQISP<60PYBU<E/!Q2A7
MYH*+.3D]/4-XHMI[<HL)=9S%U)_BXM*F$3YDFF:N1C!HGD]RK<2D*YNJ$38G
M]M9#K-U<16QN>O2]=E7;UJY>]B^V>7EPX4G.W-E[)OO#).3NF4 <2([X@5<G
M;]Z]/'U2ZS U@Q5-S6#-5C/HY+3F:^K52WNCES]HZ=%<\&DTS;V:^&&9UN!L
MX"%BKW7,K1[7UD?7[5],=)YJ]6ULA<Y<@C1851J<^1J45=V8$S;M>NWI*=!H
M 5!OF[.%MJ&<8_2MRX^9V*VJ3KY_[\1K$;@O;WF8Q&:V3QS9S88ABVEWS"FG
M8Q^:F@$BJ@VOQ!Z"RE2!:!"5P9*.5&C*5<VJL&[(L-J$RYS!'[;,#;%E:HCF
MDD![(=X^VTE$ZGC6,(-4&WB[\W:ND"RT\ME&WN[FO7K]D[/^(V[6B]DX7MBM
M1W0=$3H,Y?)>(%E?[X36>U]IMW8H(,0!<!<2?I?L@ROH>2@23VU&W;S=3P](
M]2AVH";[6F+$%V/^G5OREDC2'N[9/CVP;O4.N^_>!'O//FDD>,>=+W"B4A:\
MUBD+WK$TQ'L)7=AU]N"%B*;2'WD)U(Z.T-3JU>JAVF>:@?7%,)F@)< KD88N
MHWVRF C!1^L,?(>',9K1/C#40Z3V[5\%W"[25X/,Q_A3S<8(^!,4NZ"U62R(
M/(9,H=8 1Q\%/.%$B:Z1+.(MPL2W(3P'V6YVVH<X5]D]B23@/(3XW]N'/_S0
M%9/XP&>-^L$XOG6@UJBAQ[BTPQ*4Q(KHO"2)N@<'>6+/\CRF_/7:<QY=?2^=
MP$?_AK<D1KT'')57M3L=U%;#;M@XJKD2W_S[#.]D1'*H*FUV;#@) E"/,:+P
MF,M;[MKKA^4]UFC>OG]CJ>]'P./,Q8%H)U9;D5DB9,EVBG>_QVS$NZOJL&R3
M+W%NG]&7&Y^%WM+]!7HJV*AO2.+C==AG(,5F .M*B$1A04/TH$=_CY6/C'PL
M[D"U3GP4,FV8QE'ST*50),J(5O]HJ[;+ARP-T/ 5KX1PK2"0IR5^Z'</3^B:
M/X(E 3W2YG$!%=D>H=,?FLQ8DMSU)7<H9/OA0]B*(^[X0U]]UK,4:I98<J&G
MZ0@YG?&5LU2PP)PQ)_N0 VVH0&X[#F?$8.+YCK>,=8B1DSZE"+G#XYC)Z:81
M^"%Z1IG,&]68?;&Q8'J"D"(9EB9BC$'384&PD0+&KRN! ::L-@R?5("H_$@1
M *<QF_@M^-HB-E4C@!@JF0Y3Y K^Q'F25N0"T'92CJDV4?*\F@)#'3&G; GG
M/$;CQ>)I?9QSA?-HD0[1GQ+Z6*4TGS(:R1"YGO)D'5N83D:DWT=C3/8U 8\'
MD;TJQ%;F3'S-HN(W>'MRKNI%0+VQDJ86 ,B>_.%T!> ZR\F@*OB## $JEC"Z
M! _+\-8-G\;H:AQZ^=6EBH05"(23%2K:X/+G)02J37W\,L= MXA!M6X!'9'E
M+M*/8U2'BQAFW.5MR]S/@!?@*NC%_BW:-B&8P<(N!@[7'PZQU("A%.-5-/?*
M#"KIH6)T6+XD!R,"ZFO*;&SK)8Q/E<)7P]O]5ZKXMD^Q=%9!=%FE*K!4U*C$
MK8]S!>:ZZNM,%F0988ED@#Y2!,$A\TF>0/ N$G&\7 ]:#I=8X"@+<OTX"M@4
MJ EC#'U-&L-NBKQ,?,R+N8D2]SF79>DE,8/>1?_D\O?S=\>$LV!4..]" V#C
MB$*M)Z2?3)?AB;K&05>7RFT6+4,UY)K ;HOLEK"A+.ZFT/,$^C2*$*NX^/AK
MMT?.??Q-B0H?J\H.O1H[0=9)#9%Z[0.W1[;N:.N.-L:4;JW>:*ZBI=V"_L[T
MON@3!8*[KR\N/E*IWO_PXK=^69"9&J6.\CI#$+IYU">DCIQ&B1A)%F'>5(AQ
M<I&;@+P'I0+NY?SEK0IGV=OBU6P\B OZ#A+&+&0C2HGWA(4YI2)W\WBPADUT
M.%-\4E;0UDX^SA):!+B?6I'7&<1:9LE:S7.[Z+)K""XRO BSEN.Q:Y[?,95Q
M(RR7_5%A]:!,L2CA(M0]3"^5!FA#E.'!HL3]6.5!\>ZWC&2JZH+BLYR=KU:/
MZ&.HT;'BVV*+K@*HK:<O+]6'L<??;-L&ZVV/JK"\TUI&0C$)(<,:ESBI*-N0
M_,]*Y5<]D^0%H\ GZ6P!?@&(!.7(H%)Y05?%="'Y;1[Q,=(G:;GB09F'&/T2
M!-87<Q=/!,9=D7C:6+ 0+X.ZG%8W,*N<\[&XY8 I#Z<,*K&O#BL5B]^1JA#D
MI;HH#(_HJ0Q,03A.7%%.JQ4+)]B(&<'['.<BBE?JK(L,7^83<!QM&9)L#>$N
M/"QDE=WEMBMT 0DH()8KI@RL3VQ \#?J@CHN\+WK>#A7WR-,#%[TSU'F43 M
MXT >G4"$**[9T1#8G3A78EO1795$+FF5A:-B)57NC=56F#A*C1_IDF2I)5CB
M52EGN4:J6#$/AAK!S/2P<L7&K  K8%$A8[: B8PM8<NKRB+_ZTK)RKQV_I17
MSHLTE9#7N=9KTN(Z!]?QYFO)RTO+5%A>="LE$&UU]]!>"F]IB!.YFWJU^EBA
M+5L_@CFASQ:&'HI$?X-EZ2CT7,6G+]1X9U._S_;HKR\PM;&2+J+;?47U "G&
M#[6?(_@^S9D7*%A*$GNKUMBW.6_BXL.'=_W"@1-+IT&T_G\61.$L"'VW\3 (
M/5+=62T<JI,@U)]J;>U)$/5F^2"(?,Y&B0)+AJ%/\QLZBP'N[N[J\!QJY7,@
MX-[?BB,@:,W$YX$+&7,*J5I$HO*;-MRIV4F0Q\Y'.J%!V^*CO?71?W_D6Y\E
MYS+_UF>+/03ST:>)3U=J.P$67GT*^N\$+5+V&6IZ[1Z"K;=KM>V:J<^9CS9^
M4[(U5]7Y:]!_^NI2EW46!BJ+CZ-DJANSQ=&%IN466IBT=.+ >ST<?8N#DBR,
M*<JKR7\7FIWFT;AD-N2HQ UH(')18YEL0 =Q#?S0Y7<V71*_L8</Y@P_V\%\
MNWBK!:'D(_5ZZ+.='6*2\E>J2EN]WT77)6IM5M#"+UDJ.B)7";&K0!8>D/Q!
M.$XJ)?K>Q*/",\.(CQ,J%"E.TEE>I:$SET6T$7CF](JYO)F.R>K6F_J8&R/T
MMA=U1KO^HXFKD\+FA8!BXZBCN,"Z8D)_E$5IH[=1J;T#=MP[4$>Q'>ACV0[4
M&6W_!5!+ 0(4 PH    (  ">CCB" Q;270T  *I-   2              "D
M@0    !E>&5C=71I;VY?;&]G+FAT;6Q02P4&      $  0!     C0T     
 
end


Mime
View raw message