harmony-alerts mailing list archives

Site index · List index
Message view « Date » · « Thread »
Top « Date » · « Thread »
From nom...@intel.com
Subject [build-test alert] FAILED Windows 2003 x86: jdktools-test debug
Date Mon, 07 Apr 2008 05:45:41 GMT

BUILD FAILED:
	Ant Error Message:
D:\cc\cc-common\scripts\cc-exec-adaptor.xml:104: The following error occurred while executing
this line: D:\cc\cc-common\adaptors\jdktools-test\adaptor.xml:24: The following error occurred
while executing this line: D:\cc\cc-common\build\checkouts\hdk\working_jdktools\build.xml:242:
The following error occurred while executing this line: D:\cc\cc-common\build\checkouts\hdk\working_jdktools\make\build-test.xml:97:
There were test errors.

Date of build:	2008-04-07 12:23:46 +0700
Time to build:	21 minutes 46 seconds
Last changed:	04/07/2008 12:08:07
Last log entry:	hdk

***********************************************************
Errors/Warnings:	(31)
            
Result: 1
[cc-ant]: Test Suite 'jdktools-test' execution. Repository updated: ${repository.updated}
[cc-ant]: Check for 'run' failure of hdk = ${hdk.parameters.run.failed}
[cc-ant]: Result: failed.superiors = '${failed.superiors}'
========================================
Testing jdktools binaries...
========================================
Compiling JPDA tests
JPDA exclude list: D:\cc\cc-common\build\checkouts\hdk\working_classlib\deploy\build\jdktools.jpda.exclude
Running JPDA tests
Debugger JVM=D:\cc\cc-common\build\checkouts\hdk\target\hdk\jdk\jre/bin/java
Debuggee JVM=D:\cc\cc-common\build\checkouts\hdk\target\hdk\jdk\jre/bin/java
SAMSA exclude list: D:\cc\cc-common\build\checkouts\hdk\working_classlib\deploy\build\jdktools.samsa.exclude
Running SAMSA tests
test.jre.home=D:\cc\cc-common\build\checkouts\hdk\target\hdk\jdk\jre
Run jdk/bin/java -version in D:\cc\cc-common\build\checkouts\hdk\working_jdktools\build\test_report
java version "1.5.0"
pre-alpha : not complete or compatible
svn = r642240, (Mar 28 2008), Windows/ia32/msvc 1310, debug build
http://harmony.apache.org
Run jdk/bin/javac -version in D:\cc\cc-common\build\checkouts\hdk\working_jdktools\build\test_report
Run jdk/bin/javah in D:\cc\cc-common\build\checkouts\hdk\working_jdktools\build\test_report
Run jdk/bin/javadoc in D:\cc\cc-common\build\checkouts\hdk\working_jdktools\build\test_report
Run jdk/bin/jarsigner in D:\cc\cc-common\build\checkouts\hdk\working_jdktools\build\test_report
Run jdk/bin/keytool -help in D:\cc\cc-common\build\checkouts\hdk\working_jdktools\build\test_report
Run jdk/bin/unpack200 in D:\cc\cc-common\build\checkouts\hdk\working_jdktools\build\test_report
Compiling TOOLS tests
TOOLS exclude list: D:\cc\cc-common\build\checkouts\hdk\working_classlib\deploy\build\jdktools.tools.exclude
Running TOOLS tests
test.jre.home=D:\cc\cc-common\build\checkouts\hdk\target\hdk\jdk\jre
The test report is in D:\cc\cc-common\build\checkouts\hdk\working_jdktools\build\test_report\html\index.html
The execution FAILED with the following exception:
The following error occurred while executing this line:
D:\cc\cc-common\adaptors\jdktools-test\adaptor.xml:24: The following error occurred while
executing this line:
D:\cc\cc-common\build\checkouts\hdk\working_jdktools\build.xml:242: The following error occurred
while executing this line:
D:\cc\cc-common\build\checkouts\hdk\working_jdktools\make\build-test.xml:97: There were test
errors.

***********************************************************
Unit Tests: (160)
        
error: testOwnedMonitors001 org.apache.harmony.jpda.tests.jdwp.ThreadReference.OwnedMonitorsTest
Unit Test Error Details:	(1)
                
Test: testOwnedMonitors001Class: org.apache.harmony.jpda.tests.jdwp.ThreadReference.OwnedMonitorsTestorg.apache.harmony.jpda.tests.framework.jdwp.exceptions.ReplyErrorCodeException:
Error 20: INVALID_OBJECT
	at org.apache.harmony.jpda.tests.framework.jdwp.VmMirror.checkReply(VmMirror.java:95)
	at org.apache.harmony.jpda.tests.framework.jdwp.VmMirror.getThreadName(VmMirror.java:699)
	at org.apache.harmony.jpda.tests.jdwp.ThreadReference.OwnedMonitorsTest.testOwnedMonitors001(OwnedMonitorsTest.java:114)
	at java.lang.reflect.VMReflection.invokeMethod(VMReflection.java)

***********************************************************
Modifications since last successful build:	(1)
            
add cc-hdk log20080407120807Lbuild.672 04/07/2008 12:08:07hdk

begin 644 execution_log.zip
M4$L#! H    ( +)EASB-,<7N"@P  #Q(   2    97AE8W5T:6]N7VQO9RYH
M=&ULW5S_3^,X%O^Y2/,_6"N=EI%(Z'=*KX/$ ;,S+.R,*#OW R!D$K<-I''6
M3EJZ<_._WWMVTB9I20MK]M!5NTSJ^+WW\?/[9L=I;Q2-_8/>'7=G![U0L(,>
M)3*:^>S#SP,>1);T_F1=TJG^XY\_'[S;BD.71LR2DZ#[;NO=EB59%(?6O?L0
M<>Y+:RIU<]*MV"YB)#N.0]]SX+Y+0L'OF1.1@(X9\0+BC4,N(IM\3=HO>6B=
ML0GSL6?(1#0C+AMX@1=Y/)#Z&M@,/"$CI#_N7CL._&<Y?#SFP;5TA!=&\CJA
M]IBT'\<^H8%+Z)"BP&6:N]CSW6MGQ)P''@/MR'VXGG+QX 7#VW1 UV/ZP I<
M<8 1DQ&,D.#GBCDC?D.V/FSXV;H$8A!"4B'DS@NH0.ZVO3D7A.'XC 86@I$6
MC"&,$U!7+O-9Q&[(,?Z+LEQ/@)ZYF+U,#;H3"KH5#*=.2>?AS+H7S!IX/M,3
M[XS&W"VV)=VZJ>(LZ!/KNTI_XP= =T..!%.V E^Z!E&J1JVCPHP=\7'H^:B=
MTZ_'AT1U00IPCI#"$-BCX\<N*U"IOLDMXGM@!\\"Z_A42M^[NW99Z/-9TC<=
M@GT/#F4GW!-/6HG](@Z"(O+L?0)3?Q</ATR0TV_G'S9!&%$Q9)&ZO,?_!=L%
MP]R]IQ/Z!&]FCO?5?0S.OA@7%T.;AA2XV",J@.U,JT8-U;YWIZ']S1-13/US
MZ 3!P?[&A(1@@<Z59XDMDF!((K4=\I%Z?BS ^$AUAYP(P86^O/0@,C&?AI*Y
M7;)G5VLM(IGSUUFU[$:M;HQ5:]\8JV;3%*MFM?T&!V@05:M6SJJQ*:M:VV[4
M.Z6\ZAOSJMJ=-;R>H_@]8_;>;.P9TE;+[I2;0W-35HVVO=<TYSO&.-7WRW7U
M#%8=<PZ]QA;:&VN]8>_7:\;,O;5GS-Q-ZMU8F#$(JK5OS!C6:7UC'ZS7[%K+
MF+),)AUS[MPQENI-LC)G5R99M8UE').H#(%JVS53K,Q6D 9+AC4)YUF53+-A
M2N_5-YDE3.J]9DA79M<3Y@I(@ZCJG?+RXW\0&<R",LBJ_18+&:/K$G.!P:#:
M#>:N_WMC,+?$>:.Z,A=CS'%JF%.Z.4TUZ^4ET<:;#'6HU(P-T&"6;[:-L6KO
M&8Q6;W&K[VW&4(/&L&Z K6=8^YY!?S:H]Q?NSM56+>=73>%)_W*3IPJ7(\&H
M>\$&3+# 8?:7:<#<<PX\0!SB(1\//Y^='!OQRZHA#Z@9-#;D96HQ5C.8LDWR
M:J^UW.>L7=OF<FVK;6RA;ZYL-I>(3#[[6.<\S^&U5ROGM?D3BXZ];W"583!2
MO\V@;ZY(?7LU>-V<IIHFG?"EF?9U2[A6V]BFUIM<1)FSSY+MOU6ER<M/5'SB
MOGLR84$DS1RJV+?WURS:-D_@';M>-60P'5C_&:KY.^:.C0 K4X_P.D8?19AR
M^7;'V+H;=-4P-H/&[ H'6#=5L.(0C5F#J8>P;7.[L^W,\\!W6Q&/G9$U2"C5
M6<+NHITI)IE6-C]3V%U_?J]_>-Y_Q0-\DHYEY@0?RG5XX%#0RV\<Q'KZ[*<Z
M'JG.IP:<!#  YI*(/48[Q.5X/^ 1Q.#A)D< ]8!4CWP';++O!<1[/F8O/*:W
M)!)/K<[/[A%KHD_=O?A\[8HCFXG 1^;<D$.5L,@GG;#(&8T#^"Y(EVP[[\D1
M#V?"&XXB4MO?!U.K5ZL=<@G]$[(^'T13L 3RD<>!2_$L,:1!XH%U^I[# @EF
MM$,HS$.H3BK?^<S.RU>#3,?X4\UNV=6?2+X+6)M%_7!$ 13,&H'1AWCX%B7A
M-8@%OGD:.0G(!R+:S7J]":ZP?4X%@:41XG^_0_[M!2Z?REV/-NJ[8SEQ2*U1
M@VXNGKHD2F-Y=J,H"KN[NVE:3[(\)/SRV7->??I.'-\#_R:GJ$9]W!8F#]9;
M>S!;#;MAPZ@6D_CY7^?P382HAZJ:S3V;'/H^4;<AHC#)Q(2Y=OFP1J\UFM/?
M/EOJQ#P9,>K"0+03#UG !(VX*-A._MOOD@Y9=U45EAS\1>3V.9Y5O^*A.O9^
M0WHJV*A3\_*@C/N<)-],B'7'>:2X@"&.2 __'B@?&7I0VA'5.O5 R7<,33ED
M@8NAB!<9K?Y$P,AE QK[8/@**S(L501@6L*#GR<P@6O^'9 XZ>%L'N18H>TA
M.WVT?@Y),'V:'D!YP7-@R9 YWL!3+S(LA9HE2"[IS4_MSW&ED'(6F )SDA/T
M8$,Y<9LA7+PB,!UYSFB9ZP B)_' ')G#I*1BMFX$7@">413S636JF<E #P5'
MIB"&QA$?0]!TJ.^OE0#QZXY#@"E.&X1/+$!4?L0( (N8=7ASOI;EIFH$P@=*
MIX,84)$_8)6D)S)#M)F6)=8F2I]W,T)ACJA3M(0+)L%XH7@JCW,N=UXMT@'[
M8V0O54KS,*.A#@'UC$5EL""=#'%^7PV8Z&L!(^:']JH06UF ^)Y$Q1_D]/!"
MU8L$YHT69BI#@/;D#68K",LL)Z&JP(<D#&!BD:.+]&29WGI@,PFNQD@OO;I5
MD;!"?.XDA8HVN/1^@8%JBV9AE@-^!0ZJ=0/J$"TW*U]*F X7.,S1I6W+Z.?$
M&;H*>+$W =M&!G-:L@V!P_4& R@UR$#P\2J9[XL E?9@8G18OD4'0P'J_;%D
M;.4:AKMJPE?3V_V/JOBVCZ%T5D%T>4I58*FH4?&)!VL%ZKKJ?33J)QEA2:0/
M/I(G@2&S:9I X%O(I5RN!RV'"2APE 6YG@Q].B/8!#$&WY^39#L&+%,/\F)J
MHH@^15G47B0IZ5WV#V]_OS@[0)XYHX)U%Q@ '8<8:D=<>-%LF1ZE:QYX=:O<
M)FL9JB&=">B6A5O@!KIXG)'>B(-/@PJABI,'W[L]=.Z#'TI5<%M5=N#5T(DD
MG=00L=<.8?;0UAUMW=&&F-*MU1O-5;*T6^#?^;QG?2(G</O3Y>57+-7[7XY^
M[1<5F4RCT%%>9PADMXCZR-01LS#B0T%#R)N*,2PN4A,03[!4Q+T47]JJ>!:]
M3:Z&\2P49 !C'-. #C$E/A$6%I+RZ!;QH 0F.)PIG)@5M+6CC],(-P&>EI;'
M.J<H!8O6:AYMUF5+!&8!9VE*$8]=\WC'6,8-H5SVAKG=@Z+$O(;S5$^ 7BH-
MP(8PPQ,+$_=KE0?Y;[\F(F-5%^3OI7"^6SV4#Z%&QXH?V19=!6!;3U_>3J@?
M0R?;MHEUVL,J+.U4"B3@TX D7&4!2479AF!_5"J_Z)4DRQD%W(GGV^\9(E24
M(_Q*Y0BO\NE"L$D:\2'21W&QX@&=!Q#](B#6%PL7CSC$71Z-M+% (5XDU:\6
M0U:Y8&,^8012'BP95&)?'58J%GO$J0*2$W61&Q[*4QD8@[",7%Y,JQ4+%MC 
M&<C[#-8B"BMVUD6&)](%.(RV2(FV!G27(RADE=VEMLMU 4E 032=F"*Q?D<=
MR#^K"^R8P;WMC&"M_AXY47+4OP"=A_ZLR ,P.CX/0%WSE^&A.R)7:EO1795$
M+LXJ#8;Y2JK8&ZJM('+4-'[%2]2EUF !JYJ<Y1JI8DGF#S2#N>E!Y0J-20&6
MXZ)"QGP#$X M<4NKRCS^LE*RLJB=OZ65<U:F4G*9:WW"62QS<!UOOA>\O+!-
M!>5%MU(@T5;WA.RE\!8'L)![J%>KKQ7:DOTCLA!T94'HP4CT'V)9.@I]4/'I
M!AL?;>QW90__O"$S&RKI/+OMCU@/X,1X@?9S(-_!-7-&@J4T\7[5'OLF;]5?
M?OERUM_TM7K=^=6VY?7?OW-;/C?Z; =SV_(;/.)=C#Z./+Q23WLA,_;1*\\X
M[B+U*3AAZ2/>C<_2M(T],M^W.VM>>MH85'7Q2M!??;2DTZX%'F.Q<1C-=&.R
M>95I6F[!C2-+.S9\U\/17V%0@@82O5 MSKJDV:I6QP6KP>U11$,T$6[-&(LT
MU_C3,-=>X+)'&R\1KX258;0 _&X+XF'VJU:$TH_0^U7OMK80),:76)4>^C2"
MSAMJ[XSCQAP:*O@A4P&KJT@R-U#_A#M.+ 2XWG2$A4'"$6Y'F,@AMN!D%(=.
M71KB&<VYSRMP:3/^<$NWWNP28_(V5W4BN_YW"U>_7;,(U K&_IY" 7%_BG^4
M16FCMV%2>[OTH+>K?AQH5_]0T*[ZU:#_ E!+ 0(4 PH    ( +)EASB-,<7N
M"@P  #Q(   2              "D@0    !E>&5C=71I;VY?;&]G+FAT;6Q0
52P4&      $  0!     .@P      
end


Mime
View raw message