harmony-alerts mailing list archives

Site index · List index
Message view « Date » · « Thread »
Top « Date » · « Thread »
From nom...@intel.com
Subject [build-test alert] FAILED Linux x86: ehwa-api debug
Date Fri, 04 Apr 2008 07:57:03 GMT

BUILD FAILED:
	Ant Error Message:
/export/users/cc/cc-short/scripts/cc-exec-adaptor.xml:104: The following error occurred while
executing this line: /export/users/cc/cc-short/adaptors/ehwa-api/adaptor.xml:82: The following
error occurred while executing this line: /export/users/cc/cc-short/scripts/framework.xml:1079:
Java returned: 1

Date of build:	2008-04-04 14:56:49 +0700
Time to build:	7 seconds
Last changed:	04/04/2008 14:29:45
Last log entry:	drlvm

***********************************************************
Errors/Warnings:	(15)
            
[cc-ant]: Test Suite 'ehwa-api' execution. Repository updated: ${repository.updated}
[cc-ant]: Check for 'run' failure of drlvm = ${drlvm.parameters.run.failed}
[cc-ant]: Result: failed.superiors = '${failed.superiors}'
[ehwa-api]: ============= Adaptor for ehwa-api: Run ...
[java] Java Result: 1
[java] Java Result: 1
[java] Java Result: 1
[java] Java Result: 1
[java] Java Result: 1
[java] Java Result: 1
BUILD FAILED
/export/users/cc/cc-short/build/checkouts/drlvm/build.xml:339: The following error occurred
while executing this line:
/export/users/cc/cc-short/build/checkouts/drlvm/make/tests/ehwa-test.xml:100: Eclipse HelloWorld
scenario FAILED
Total time: 5 seconds
The execution FAILED with the following exception:
The following error occurred while executing this line:
/export/users/cc/cc-short/adaptors/ehwa-api/adaptor.xml:82: The following error occurred while
executing this line:
/export/users/cc/cc-short/scripts/framework.xml:1079: Java returned: 1

***********************************************************
Unit Tests: (0)
        
No Tests Run: This project doesn't have any tests

***********************************************************
Modifications since last successful build:	(1)
            
add cc-drlvm log20080404142945Lbuild.1113 04/04/2008 14:29:45drlvm

begin 644 execution_log.zip
M4$L#! H    ( !UWA#AA=;C>Z@,  $L<   2    97AE8W5T:6]N7VQO9RYH
M=&UL[5EM;]LV$/ZZ^5?PR]!N@"3;0;M4<[REB8LD2+ A2]L-06#0U-EB3)$"
M2=G.?OV.E)W9G64E[M F@XE$MJCC\;F7YVB1G=1FHML9J.2NV\DU=#N4&'LG
MX.#%4$D;&/X7Q&2_^=U/+[J-(D^HA<!,9-QHZ *OQ+5K8*FZP8]T2@.:\YN8
M'"PW<IC0W"I-AOB_$(K)92%)&(9S';=T0F_(VX*+9,@%SCEP7\-9)E8$5FZ<
MKM""L7&U3)"+8L1E0-$8AA9I/EB57C;A* 4VYG+DD48PRY6V46% FX@Q_ M,
MZGH\M(@Y8558?*:R3,F^!J,*S<!$">0@$Q/=4ARY-'/0"IN#]G)/B"(;P'/)
M;5!CH<<1&+!%OD$J45,I%$T"8(+G!C:(<FDL%>(1DJ6/-PAZ=(&+5[7SWQOG
M^5XY*=D+VV&3",4PXQ)";6TX!!^8: XY<*-%(.0LF.V_7O16P\-<7@-N-10+
MF6! +4O_;<9U-DZXQAS2X"'C3?R('$JTF&3WILABUD?D_1%C_00&Q2AR28#V
M(8!H.C9YI1<K'RS:06VK5>&8NXC3"0BA/BHM$E+X !X)#M*23"5 SDZOR,L$
MAK00]OLO@6R-0/G]YU^^_28+C:H4.+GXL_='[[SYNMTCI]*"EE20#Q<$M%88
MR'<4BU)"K"+,QY><X2A\7JGOW>'I>>_8#>!RHL8XX,-%6"D]O%?O.!J3=K/9
M>D,PI6$C: _B$@RZ-R:M[9/W.@$!%F[(L?MT4<3L!88U^^X+IO".026#;CFN
M#%*%9[VKK\J9(RJELCXC2>^"X"J7*^FX/=0J(R>'.T;M&/6\&/7K;T^947D=
MHS8DY[,DWHY1SY91W.45OB_B]0DSJG:-VC%JQZ@GPJC?04] W[\W[5BU8]6.
M59_-JN-R\Z&D%?8P("/69XQP0Z3";@U?E6FU^Q+_:RZ56Y>>3+HT<8,G?ZAN
M-:/^28^/A\18:@M#ZD<]9*Z:P%?NA2W\^_(2;*$E5EB4P)1LU>V2+>T-?+8.
M?!O:6L?2[[^M=7RRXFVMYP$<?Z#NZANK"I8&+L\+S-3 'U&L@<54?H=%%Z^N
M^+2(DW.T^(\K;S7.M^]/SX_GUJX\V J!.WZ)]_;>Q.0J!3)46%RGSC!?58AB
MK- :>3]-G9DP U;X!<^FZ%H$_XF+'@LAHV-86FG\.8A'U&HVXW4EWS"05'.U
MSOZ5FRMEL3Q:GD%,7A$#3,G$-!K.R+D52BY29LIMBA:MF#]CD#N9N+&M7ZI]
M0<O#LKG--.>+'F_Z?GO[6%3/:9CF.;IYJ&D&4Z7'<S?_B)'W*X7VM('$+4&=
MB'8[D3\KC,ISP\@?(OX-4$L! A0#"@    @ '7>$.&%UN-[J P  2QP  !( 
M             *2!     &5X96-U=&EO;E]L;V<N:'1M;%!+!08      0 !
+ $     :!      ! 
end


Mime
View raw message