harmony-alerts mailing list archives

Site index · List index
Message view « Date » · « Thread »
Top « Date » · « Thread »
From nom...@intel.com
Subject [build-test alert] FAILED Linux x86_64: jdktools-test debug
Date Thu, 03 Apr 2008 23:53:04 GMT

BUILD FAILED:
	Ant Error Message:
/export/users/cc/cc-common/scripts/cc-exec-adaptor.xml:104: The following error occurred while
executing this line: /export/users/cc/cc-common/adaptors/jdktools-test/adaptor.xml:24: The
following error occurred while executing this line: /export/users/cc/cc-common/build/checkouts/hdk/working_jdktools/build.xml:242:
The following error occurred while executing this line: /export/users/cc/cc-common/build/checkouts/hdk/working_jdktools/make/build-test.xml:98:
There were test failures.

Date of build:	2008-04-04 06:34:52 +0700
Time to build:	18 minutes 5 seconds
Last changed:	04/04/2008 03:25:05
Last log entry:	hdk

***********************************************************
Errors/Warnings:	(28)
            
Result: 1
========================================
Testing jdktools binaries...
========================================
Compiling JPDA tests
JPDA exclude list: /export/users/cc/cc-common/build/checkouts/hdk/working_classlib/deploy/build/jdktools.jpda.exclude
Running JPDA tests
Debugger JVM=/export/users/cc/cc-common/build/checkouts/hdk/target/hdk/jdk/jre/bin/java
Debuggee JVM=/export/users/cc/cc-common/build/checkouts/hdk/target/hdk/jdk/jre/bin/java
SAMSA exclude list: /export/users/cc/cc-common/build/checkouts/hdk/working_classlib/deploy/build/jdktools.samsa.exclude
Running SAMSA tests
test.jre.home=/export/users/cc/cc-common/build/checkouts/hdk/target/hdk/jdk/jre
Run jdk/bin/java -version in /export/users/cc/cc-common/build/checkouts/hdk/working_jdktools/build/test_report
java version "1.5.0"
pre-alpha : not complete or compatible
svn = r642240, (Mar 28 2008), Linux/em64t/gcc 4.1.0, debug build
http://harmony.apache.org
Run jdk/bin/javac -version in /export/users/cc/cc-common/build/checkouts/hdk/working_jdktools/build/test_report
Run jdk/bin/javah in /export/users/cc/cc-common/build/checkouts/hdk/working_jdktools/build/test_report
Run jdk/bin/javadoc in /export/users/cc/cc-common/build/checkouts/hdk/working_jdktools/build/test_report
Run jdk/bin/jarsigner in /export/users/cc/cc-common/build/checkouts/hdk/working_jdktools/build/test_report
Run jdk/bin/keytool -help in /export/users/cc/cc-common/build/checkouts/hdk/working_jdktools/build/test_report
Run jdk/bin/unpack200 in /export/users/cc/cc-common/build/checkouts/hdk/working_jdktools/build/test_report
Compiling TOOLS tests
TOOLS exclude list: /export/users/cc/cc-common/build/checkouts/hdk/working_classlib/deploy/build/jdktools.tools.exclude
Running TOOLS tests
test.jre.home=/export/users/cc/cc-common/build/checkouts/hdk/target/hdk/jdk/jre
The test report is in /export/users/cc/cc-common/build/checkouts/hdk/working_jdktools/build/test_report/html/index.html
The execution FAILED with the following exception:
The following error occurred while executing this line:
/export/users/cc/cc-common/adaptors/jdktools-test/adaptor.xml:24: The following error occurred
while executing this line:
/export/users/cc/cc-common/build/checkouts/hdk/working_jdktools/build.xml:242: The following
error occurred while executing this line:
/export/users/cc/cc-common/build/checkouts/hdk/working_jdktools/make/build-test.xml:98: There
were test failures.

***********************************************************
Unit Tests: (160)
        
failure: testThreadGroup002 org.apache.harmony.jpda.tests.jdwp.ThreadReference.ThreadGroup002Test
Unit Test Error Details:	(1)
                
Test: testThreadGroup002Class: org.apache.harmony.jpda.tests.jdwp.ThreadReference.ThreadGroup002Testjunit.framework.AssertionFailedError:

testThreadGroup002 FAILED:
## Unexpected thread status found out for some tested threads!

	at org.apache.harmony.jpda.tests.jdwp.share.JDWPTestCase.printErrorAndFail(JDWPTestCase.java:753)
	at org.apache.harmony.jpda.tests.jdwp.ThreadReference.ThreadGroup002Test.testThreadGroup002(ThreadGroup002Test.java:286)
	at java.lang.reflect.VMReflection.invokeMethod(VMReflection.java)

***********************************************************
Modifications since last successful build:	(1)
            
add cc-hdk log20080404032505Lbuild.743 04/04/2008 03:25:05hdk

begin 644 execution_log.zip
M4$L#! H    ( )TVA#@'=BN;E P  /]'   2    97AE8W5T:6]N7VQO9RYH
M=&ULQ5QM;]NV%OYL_PIBP,52(*+?+=O7#9#;E[5=NA5QUB]%$# 2;2N118V2
MDGB]^^_W'%*R+<=1[?6DU]A2B>(Y?'C>2=$>S]-%>#*^5O[R9!QK>3(6+$F7
MH7SY\U1%J9,$?\D1&S3_]>^?3^I9[(M4.LE=-*K7G42F6>S<^+>I4F'BW"?8
MF'<IM^H,"%YG<1AX\-!GL58WTDM9)!:2!1$+%K'2*6>?\O8+%3MG\DZ&V#.6
M.ETR7TZ#*$@#%27V&MA, YVD2-^0#\B@D252)PW/@_\<3RT6*FHDG@[B-&GD
MC *9\(=%R$3D,S$3.'8E^746A'[#FTOO5F7 9N[?-NZ5O@VBV54QQ\9"W,JM
M >KU5";IJ,[P\T5Z<W7)ZB_W_-0O@!9&8,4([#J(A$;6G._/I>Z%4D0. DD<
M0!]G%M 77X8RE9?L-?Z+X_B!!K$KO?QN4=A...25EL@)4*AXZ=QHZ4R#4*(U
M>/.%\LLM>9>1%9L#SS/SQ$AO<0OX+MDK+8WQP,WH.7":)BNMLMY>J44<A"BG
M#Y]>GS+3HUX'7XD%S$$^>&'FRS*)Z9@_86$ EO!/$7NA2)(PN&[X,@[5,N];
MS(/?@+OQ?"#C9[LF<)Y%T1;\S<<,#.$ZF\VD9A\^?WQY(-!4Z)E,S>4-_J]E
M ZRU<2/NQ.Y1Y'.,\N4F@^BPGJK2,RYB 4SX7&C@NK2B,K/G-_Y]S#\'.LU$
M^!$Z033AGP$'1!=TO1)';$@81C#6.F9O11!F&DR3-8_9&ZV5MI<7 40R&8HX
MD?Z(N=QM]5@BO>_FU.'-'A6G08>$49>W!C20NKSKMJDFUZ3BU!O0<.KRIELI
M\<Z^G%IMWNR[5:S:^[(:\&:7S)Y:- ;E\DZK12.H%A]6VT%W7U;M+A^2>9[K
M#HDX]?MDKM?KDG#J<;=3R:F_]^Q:O%^IO+VMW.7]7I_*RH<TX0!R0IO&7P#3
M@$9WP*D[(.(T;%=RVMOQ6F!072I!N5TJ0;D=&H-J<[?:R ]PX5ZG,BD<9.14
MG/HNE9P&?3(C'U"%WP%9;=#JD>FN3^7"A'*J3E,'E"N=%@TFE#A5ZFP2!7+ 
MU**J6MT!F16T*XNQ@U("%:<!G9S(8N:P1<7)[9'-CBQFND,:&X<X3I0YP0IZ
M9/&I0[;NI./4(ZMZ"#F1V5/U O80O^N0E:QDFS14<FJ3U9F4BTZ7S._<'DU&
M@!Q<O9NU]Y9!&TK6)HUI=GE_0,.IQUM$ZS*7=YLT(F_S8?5VUB'*:Y&5]GVR
M-?60K.PA"@98'E8Z7F]OW;F$*^%!DXK3T*6*!BVB[#( 3C2QKD6W6$161/-#
M5D1I 5D-J594_6&E31VP\>=6;R4?$#B''9K0TN/] \)=JY)3L[-C=F\F%_N\
M[[J8:RG\<SF56D:>S.]_T2J+F\TVXF%O3]^?O7E-L3-5O4+>6Y]]WG5I+*//
M>]6)</^7#!W>K3;70[;+AE3%;)_(&;%4IUKZN42;-["()"H<879$Z:L%!D5E
M!2TZW=%M2A#E"0A_;:HE<I]HJ[/+VV2;@:TAE8T_;9D[XO(_/^CP3H7^FSL9
MI0G)68<![Q&]/.B[X%(T:G%YFZAB@@Q$M/?H\@Z1H&!11^3F;5BRT@3[/B18
MHA=;.#VRU>^ 9CL%;+/CTH "276(-E1ZO-.GF1^6X#3:Z^-;5SN]>JHR;^Y,
M<SISW&]4M$K#8-4F5\?^1M\X6S<Y_3CY,8?K$K%(UJ?K$(&G(D^ 8'Y3 ""P
MAS3-(49SH#12+()Y2)^E\B$]9K["YY%*(>[.OGDZS\[+="@]QQ9^HR&^JX7\
M_G-SVV/C(=/563KFW-EC<!3'8A^?L<R'?I#>)3LU28N]LTF+G8DL@GO-1NS(
M>\%>J7BI@]D\99!?P?;:S>: 74#_G&RBIND]F A[J[+(%W@N&%(A"\!<P\"3
M40*V=<P$Z"4VIXZO0\E+PYO9%I/]"8HYWOR)E7J $3HBC.<"(($.&4P]QG.S
M. Y>PZ# M422W$7L)=/];KO=!<<X^B@T:P\,^!?'["R(LH>&7/2[:6/F>5@[
M<.CEX[%(9H158C9/TWC4:!19/4_RD.\K->C]0!6^\<( G)Y]0%G:4[*@P":4
MCJ"Q#N_@[-:*?/^?CW"G8Q1'TVC4Y>PT#)EY#&%& L@[Z?/*^<V??UH??GOO
MF"/P; X+9)B1]?"9C*06J=)E0RK=_)&(F1SM*LKRX[HX _X1SYU_4;$YS7[)
MQB8,F</PR<G3O%<$I5;&G&NE4L,"3'+.QOCWQ/C*+( RCYG6^P $?2W1J&,9
M^1BBU!:?W9\4^/AR*K(0/,#@1'X5(@! C\#@YPE X)_/CD>Q,:KPI,0(+0^9
MV8/Q*SQ:VL/P@"B(#L"4Q-(+IH'Y5L)VK-G&X[/QZL3]"E2!IV1S!2HO/_L.
M=E,:;"]XZ]/]]_/ FS]F.H6XR0*P0.G))!%Z60T_B, 1M@=Y;QJ-1C9PQUHA
M2QA$9*E:0,CT1!A^@S_$KVL%865;7>K>U"(F6:*WPQ*F&FO)L39YF:J!J:D1
MYC0#1.Q/6"%9_6T0[27>!&L5(\CK)1.@&^%MZ?]<)F"N4$-51C9?>3\@ML% 
MKW&@Q.2T %,:"A+0+V5:@0]2R@PU_ ,0ZHD=:B[#F.\(K[4UFJ]Y3/R;?3@]
M-[4D S6*LN(V^J-M!=/E#KJGK2BGJ<&'Y>2@9>3G(S5[1.W<RF4"_B;9N+BZ
M,G&PQD+EY;6*M;WB>9G>-*7+>),!W@(#T_IMXAA->'/T) $U^,!@A:UH>P1]
M1;M!5@-/#N[ R)%^1<J.('3XP70*=L"F6BUV#?EB"YX1'&C$QN0K]#/D;[X*
MED^L4KCPT.AY-SF?O#6E.'\-M;2)H8]T:6)+S4Q)W06PA!"^;[Y8)L(\&6P/
M&(*#E"E@NO*^2!UP%ZLD>50-.I[44-<8P_&#) [%DF$3A!G\&ES"CL"#(%1"
M-BSL$J$7&+<$ER:"C2\FIU=_G)^=(,N2+<$2##0O%C$&VKG20;I\1(YC6Q9X
M=64<9=,B3$.A ^BV";;,#.3PL&3CN0(7!NE!Y9:<?!V-T9=/_C9B@L>FF@,O
MADXL[V3FA[V.F>0S;CMRVY%#"!FUVIWNCJ&L+^#?E<(W':$TWM&[BXM/6*-/
M?G_UZ^3%(VZH0&UCO,T/R&T=\Y&GIY=QJF9:Q) O#5]84A3*U[LY&MIQ@:YH
M-2RW/"S9#>(@#&P*$UR(2,PP&>X.!.N!RMC6$>!ID.!D5"@Q_%LC1[<6*>X$
M/#E8&>F*H HJ&BD]UDT_?7J\3;B;)%5X%SX]V@66;3,HC(/9YO;!]H!EZ9:)
M=D-^5 B \6 29PXFY^<O!DHWO^9C9Z8**#TJ8'UUQC@XA!D;*/[>;+$Y']O&
M]O+J3H09=.*<,^?#&(NPHE,%BDC=1RSGF91AU(QU:/EGK?:+72W*DEG DZS8
M<]^@00EY.JS57N%5.4=H>5?$>8CO:99L$ZL(HEX*M/9B[=ZI@G"KTKFU%JB]
MMRCMMX ADYS+A;J3#)(<+!%,&M\94&J.5350O#$7I:GA:";A8NA-4E]EV^/!
M^AGX O5$PLK# ,6^MJ (=+&^AIEN$:*I =G%'(I68W:%Y2I;(S*0C2@TLD5K
MOUD.U._-!?;; 'WDS6$I_@(9"?9J<@[2CL/E%@L Z(4J DFMOL$.O1&VD=CC
MWJ;T\5&;(IJ5*Z:MSE!41:EGU/<)+U&*5G9;0(U6'M5"-2>1X=32K^P-:E-H
MS.NL$A,3*E;;E@!KFUE1.9;!5Y2+M75M_+FHC#='-.)]VI7>H?(JO-D&F:];
M+EW>@H(R8E3;HK"6MG/<1P$MBV"]=MMN-I\_F.6;0VP]Y!<'P@U&G_\RQ[&1
MYZ6)29?8^,"QWQ<^^^N2+3F4S"5N1V^Q!$#5!)'U;Z ^Q@7RQ@".$<B+[?WU
M/;[J?O'[[V>3O;[K;GO^B/UX^_='[<=O2F#S^7/LQ^_Q5G<M@BP-\,J\X(6<
M.$'_/%.X:S01X(]5;W7W/B[3X=TVS3NJ/N\,*]]1[8VIR9NM[WRQ9'.M _[B
MR$6<+K$IWZ-:-6S?X_Z08]UY5+?X[1W,0HLH0><S"[ 1ZW:;@T796G#;$S$P
M2X,;+\\1:!KX,RZ-(/+E \?+>CV!56"ZPEV'F+B^L5(PHM%V;ZI>1Z 863)3
M:]@3!S9EF$TRA?MO:)K@?M)$JI$AV7B <F?*\S*MP>7NYU@,Y!SA<8KI&T(+
MJ*%B]L(74/9"Z^H'9!!ET8R_K#)J=T?L&4;>7^XYBO;_#X;YP9EU$#> A@.#
M!_+!/?XQ-E<X"*^/&^)DW#"_[].PO_5C+.;D?U!+ 0(4 PH    ( )TVA#@'
M=BN;E P  /]'   2              "D@0    !E>&5C=71I;VY?;&]G+FAT
8;6Q02P4&      $  0!     Q P      
end


Mime
View raw message