harmony-alerts mailing list archives

Site index · List index
Message view « Date » · « Thread »
Top « Date » · « Thread »
From nom...@intel.com
Subject [build-test alert] FAILED Linux x86_64: classlib debug
Date Mon, 31 Mar 2008 14:11:45 GMT

BUILD FAILED:
	Ant Error Message:
/export/users/cc/cc-short/scripts/cc-exec-adaptor.xml:104: The following error occurred while
executing this line: /export/users/cc/cc-short/adaptors/classlib/adaptor.xml:28: The following
error occurred while executing this line: /export/users/cc/cc-short/build/checkouts/classlib/build.xml:282:
The following error occurred while executing this line: /export/users/cc/cc-short/build/checkouts/classlib/make/depends.xml:339:
The following error occurred while executing this line: /export/users/cc/cc-short/build/checkouts/classlib/make/depends.xml:428:
The following error occurred while executing this line: /export/users/cc/cc-short/build/checkouts/classlib/make/depends.xml:456:
java.net.ConnectException: Connection timed out

Date of build:	2008-03-31 21:08:01 +0700
Time to build:	3 minutes 31 seconds
Last changed:	03/31/2008 20:28:59
Last log entry:	HARMONY-5626 [buildtest][gut] TSSConfigEditorTest hangs
Updating the dependencies for common_resources and classlib
from yoko_M2-20070130 to yoko-1.0-SNAPSHOT-20080304

***********************************************************
Errors/Warnings:	(3)
            
Checking depends/jars/yoko-1.0-SNAPSHOT-20080304/yoko.jar
Fetching depends/jars/yoko-1.0-SNAPSHOT-20080304/yoko.jar
The execution FAILED with the following exception:
The following error occurred while executing this line:
/export/users/cc/cc-short/adaptors/classlib/adaptor.xml:28: The following error occurred while
executing this line:
/export/users/cc/cc-short/build/checkouts/classlib/build.xml:282: The following error occurred
while executing this line:
/export/users/cc/cc-short/build/checkouts/classlib/make/depends.xml:339: The following error
occurred while executing this line:
/export/users/cc/cc-short/build/checkouts/classlib/make/depends.xml:428: The following error
occurred while executing this line:
/export/users/cc/cc-short/build/checkouts/classlib/make/depends.xml:456: java.net.ConnectException:
Connection timed out

***********************************************************
Unit Tests: (0)
        
No Tests Run: This project doesn't have any tests

***********************************************************
Modifications since last successful build:	(4)
            
modified vmz  /harmony/enhanced/common_resources/trunk/make/depends.properties 03/31/2008
20:28:59 HARMONY-5626 [buildtest][gut] TSSConfigEditorTest hangsUpdating the dependencies
for common_resources and classlibfrom yoko_M2-20070130 to yoko-1.0-SNAPSHOT-20080304
modified vmz  /harmony/enhanced/common_resources/trunk/build/depends.properties 03/31/2008
20:28:59 HARMONY-5626 [buildtest][gut] TSSConfigEditorTest hangsUpdating the dependencies
for common_resources and classlibfrom yoko_M2-20070130 to yoko-1.0-SNAPSHOT-20080304
modified vmz  /harmony/enhanced/classlib/trunk/make/build-java.xml 03/31/2008 20:28:59 HARMONY-5626
[buildtest][gut] TSSConfigEditorTest hangsUpdating the dependencies for common_resources and
classlibfrom yoko_M2-20070130 to yoko-1.0-SNAPSHOT-20080304
modified vmz  /harmony/enhanced/classlib/trunk/make/depends.properties 03/31/2008 20:28:59
HARMONY-5626 [buildtest][gut] TSSConfigEditorTest hangsUpdating the dependencies for common_resources
and classlibfrom yoko_M2-20070130 to yoko-1.0-SNAPSHOT-20080304

begin 644 execution_log.zip
M4$L#! H    ( '6I?SB2JE+EB (  & (   2    97AE8W5T:6]N7VQO9RYH
M=&ULS59-;]LP#+W[5_ RY&0K3=*B\;( 13^V <56H-FIZ$&1F%B-+ F2G#3[
M]9/DI&VZ9MB&K9OA@RV2CX^/^AI5OI;CT53S]7AD+(Y'%)Q?2WS7F6GE<R>^
M8@G'W3=O.^.L,9QZS-U2E1G$YP;OD=W"E_A=TP62:2,DS^_HDA;WM=SCQ-&@
MXJXP5ANT7J#;<=SYN4#/*J'F@/<>K:(2A,<:A/(:.K7FC41'F%:LL1:5)\Y3
MQ:GEG=W<B3A_! G1%I?"":W@:- ;#@^+_1RVT2\%9;8)8IPU1@J6G$)1=\@\
M*%ICH FB-MKZ JXVXQ-M\DM<HH1-^6O@.!-*^ #KVN\ ,Q/6^1A/\#X"D,:A
M#96R\.:NBB..66&\(X\R1LTAU ]T3F/J'T6G3A%6(5OH)J P29V38DI2BW8Q
MLVP6VY!O&E=F6<[U2DE->3L1;NH%%_863BTF$<)/^3NY-PG('0T1:[W0^4'1
MS:\_G5Q=?_@\R7O=[G&WWQULN\,J'7)&F#A#?C(XF8K@%*H(=*5</RMF"_PP
M]7X9&%J8.?I;>(_>!Y 2*N]-28A!;206U-!0?Z'M/ B^1)4[14U0QP=.1COA
MM5V3:&T=$W:;VQED.=-V2LE3&L^-B>.66G$P[/<'!V'L.;V)_IN->EF2<VNU
MA7DKS/^C2US?KR%%-JD0XL[2Q"4/%R<?+\_/8"5\!3Y89EI*O6JW/(8F^I0I
MY(DA":A9VO0XK"HA'Q"#V5?"@0S;2)GMKX=R:H*83PK9C,0%7_:.2_CS.?=J
MF R;Q+U7S;QS($4"_?[PWQ(8O++VWQ,X/"HA'>$*?7&JE0KGUOG#7(3-2)R[
M7M2!3\#+1H2.1R1=($A[F2#I9O$-4$L! A0#"@    @ =:E_.)*J4N6( @  
M8 @  !(              *2!     &5X96-U=&EO;E]L;V<N:'1M;%!+!08 
1     0 ! $    "X @     ! 
end


Mime
View raw message