harmony-alerts mailing list archives

Site index · List index
Message view « Date » · « Thread »
Top « Date » · « Thread »
From nom...@intel.com
Subject [build-test alert] FAILED Windows 2003 x86: jdktools-test debug
Date Fri, 28 Mar 2008 09:44:31 GMT

BUILD FAILED:
	Ant Error Message:
D:\cc\cc-common\scripts\cc-exec-adaptor.xml:104: The following error occurred while executing
this line: D:\cc\cc-common\adaptors\jdktools-test\adaptor.xml:24: The following error occurred
while executing this line: D:\cc\cc-common\build\checkouts\hdk\working_jdktools\build.xml:242:
The following error occurred while executing this line: D:\cc\cc-common\build\checkouts\hdk\working_jdktools\make\build-test.xml:97:
There were test errors.

Date of build:	2008-03-28 15:22:26 +0600
Time to build:	21 minutes 58 seconds
Last changed:	03/28/2008 14:42:19
Last log entry:	hdk

***********************************************************
Errors/Warnings:	(49)
            
Result: 1
[cc-ant]: Test Suite 'jdktools-test' execution. Repository updated: ${repository.updated}
[cc-ant]: Check for 'run' failure of hdk = ${hdk.parameters.run.failed}
[cc-ant]: Result: failed.superiors = '${failed.superiors}'
========================================
Testing jdktools binaries...
========================================
Compiling JPDA tests
Since fork is false, ignoring memoryMaximumSize setting
----------
1. WARNING in D:\cc\cc-common\build\checkouts\hdk\working_jdktools\modules\jpda\src\test\java\org\apache\harmony\jpda\tests\framework\TestOptions.java
(at line 505)
internalProperties.put(name, value);
^^^^^^^^^^^^^^^^^^^^^^^^^^^^^^^^^^^
Type safety: The method put(Object, Object) belongs to the raw type HashMap. References to
generic type HashMap<K,V> should be parameterized
----------
1 problem (1 warning)
JPDA exclude list: D:\cc\cc-common\build\checkouts\hdk\working_classlib\deploy\build\jdktools.jpda.exclude
Running JPDA tests
Debugger JVM=D:\cc\cc-common\build\checkouts\hdk\target\hdk\jdk\jre/bin/java
Debuggee JVM=D:\cc\cc-common\build\checkouts\hdk\target\hdk\jdk\jre/bin/java
SAMSA exclude list: D:\cc\cc-common\build\checkouts\hdk\working_classlib\deploy\build\jdktools.samsa.exclude
Running SAMSA tests
test.jre.home=D:\cc\cc-common\build\checkouts\hdk\target\hdk\jdk\jre
Run jdk/bin/java -version in D:\cc\cc-common\build\checkouts\hdk\working_jdktools\build\test_report
java version "1.5.0"
pre-alpha : not complete or compatible
svn = r642143, (Mar 28 2008), Windows/ia32/msvc 1310, debug build
http://harmony.apache.org
Run jdk/bin/javac -version in D:\cc\cc-common\build\checkouts\hdk\working_jdktools\build\test_report
Run jdk/bin/javah in D:\cc\cc-common\build\checkouts\hdk\working_jdktools\build\test_report
Run jdk/bin/javadoc in D:\cc\cc-common\build\checkouts\hdk\working_jdktools\build\test_report
Run jdk/bin/jarsigner in D:\cc\cc-common\build\checkouts\hdk\working_jdktools\build\test_report
Run jdk/bin/keytool -help in D:\cc\cc-common\build\checkouts\hdk\working_jdktools\build\test_report
Run jdk/bin/unpack200 in D:\cc\cc-common\build\checkouts\hdk\working_jdktools\build\test_report
Compiling TOOLS tests
Since fork is false, ignoring memoryMaximumSize setting
----------
1. WARNING in D:\cc\cc-common\build\checkouts\hdk\working_jdktools\modules\tools\src\test\java\org\apache\harmony\tests\tools\javah\Test\Test01.java
(at line 24)
private static final long xxx2 = 1;
^^^^
The field Test01.xxx2 is never read locally
----------
1 problem (1 warning)
TOOLS exclude list: D:\cc\cc-common\build\checkouts\hdk\working_classlib\deploy\build\jdktools.tools.exclude
Running TOOLS tests
test.jre.home=D:\cc\cc-common\build\checkouts\hdk\target\hdk\jdk\jre
The test report is in D:\cc\cc-common\build\checkouts\hdk\working_jdktools\build\test_report\html\index.html
The execution FAILED with the following exception:
The following error occurred while executing this line:
D:\cc\cc-common\adaptors\jdktools-test\adaptor.xml:24: The following error occurred while
executing this line:
D:\cc\cc-common\build\checkouts\hdk\working_jdktools\build.xml:242: The following error occurred
while executing this line:
D:\cc\cc-common\build\checkouts\hdk\working_jdktools\make\build-test.xml:97: There were test
errors.

***********************************************************
Unit Tests: (160)
        
error: testOwnedMonitors001 org.apache.harmony.jpda.tests.jdwp.ThreadReference.OwnedMonitorsTest
Unit Test Error Details:	(1)
                
Test: testOwnedMonitors001Class: org.apache.harmony.jpda.tests.jdwp.ThreadReference.OwnedMonitorsTestorg.apache.harmony.jpda.tests.framework.jdwp.exceptions.ReplyErrorCodeException:
Error 20: INVALID_OBJECT
	at org.apache.harmony.jpda.tests.framework.jdwp.VmMirror.checkReply(VmMirror.java:95)
	at org.apache.harmony.jpda.tests.framework.jdwp.VmMirror.getThreadName(VmMirror.java:699)
	at org.apache.harmony.jpda.tests.jdwp.ThreadReference.OwnedMonitorsTest.testOwnedMonitors001(OwnedMonitorsTest.java:114)
	at java.lang.reflect.VMReflection.invokeMethod(VMReflection.java)

***********************************************************
Modifications since last successful build:	(1)
            
add cc-hdk log20080328144219Lbuild.648 03/28/2008 14:42:19hdk

begin 644 execution_log.zip
M4$L#! H    ( (U]?#B7X%J!=PT  ,)-   2    97AE8W5T:6]N7VQO9RYH
M=&UL[1S];]LV]F<'Z/_P,."P!(@4VW$<QW,#Y)IV;=>T19QU/]2]@)%H2XDL
M:I04Q^OU?[_W2,FV9$=V.J;M'<[84HGB^^#[)D6QYR7CX+AW)=SI<2^2_+C'
M($ZF 7_Z\U"$B17[?_$N=.K_^.7GXR=;:>2RA%OQ;=A]LO5DRXIYDD;6M7N3
M"!'$UB36S5FW<KM,">PTC0+?P><N1%)<<R>!D(TY^"'XXTC(Q(;W6?N%B*PW
M_)8'U#/B,IF"RX=^Z">^"&-]C6B&OHP3@C_M#AP'_[,<,1Z+<! [TH^2>)!!
M^SRV[\8!L- %-F)$<!GF*O4#=^!XW+D1*<)Z[LU@(N2-'XXN\P$-QNR&E[#2
M !,>)SA"H-]'[GCB$VP]W?"W=8' 2 1R(G#EATP2=MO>' NQX02<A18Q$ULX
MABA-E/@=$4VM:\FMH1]PK1''&PNWW)9UZ^8CLK!/JI^J@8UO7%]^@F>2*R7B
M3??KI*@[$8E+R4GSCT<@IL&H6RV7DI:>B7'D!R3]U^]/3R"#>#1F!D[ XICG
M)*[9+7,6F6@>-B 6J70X*+U (AZ)9M\/B0C"@1_#D 4QWP5_% I)?(SY6,CI
M&;OSQ^FXCY$ T.')2(M(K-FOV-ZPX8^3\[>OWO[Z]8ZF36]PC1%E$$M'C65 
M^ ="C@8L8HA@X#&)&*>ZEQ[M4&),(70#\JMWD8H8-@$6>81ME@ *G<-!_6"G
M^*SFAPF7(0O>SST=G6F;PM4NW+(@Y3N_E$#^M?Y7A+B81BA6-N3)M L7'D>A
M)Y[ V(B$WEU1&-P%_>\.7/% A"-E#@GVE&P""8&_9+%WQB(;SOF02XXJ57U&
M/.32=PI]>K_M?CB&V!-IX"(^B!@)"H>)VG4W5"M%XZN CV&[ 1,F0]38#OD7
MI@]$QRU^YP2IRTL^ICPK>X02QTCY()-0YAOX5P.71X&89GUS0[%)]7:&/<LU
M*SW]/ W#57Z>/P<XY5?I:,0EO/YP]G03#A,F1SQ1E]?TO^1[&+KWYK:VA)N;
MP_WQ.L5T.!\7>H6MO<+.O$*+1@W5OG8GD?W!ETG*@C/LA'9O?^ R1N<@-RFB
MI)88*&E#8Q=>,#]()68!J._"<RF%U)<7/N9N'K HYFX7VO;1P3Y&">?OHSJP
M]YL=8ZC:QC =-7Y$5 9%U3*FP%:G58EJ?U-4C;;=[%0+J[DQKKK=:33-2:MZ
MB ^1UAK/V5Q:!W;GX*@25VM37/MMN]TY-#7$ V-B-Z?!CCG7.6Q7#["]L=3W
M[4ZU A]B[NUZ-:X'C+#9,2;WPR-C9K7?,!:R#MK&!GAP6&U8&_M@LV$WS*FP
M53<G=W,);%UX?PBJ?6,AN6DN8)F+,LV6.7=N&ZN+C"FP;=?7.,Y#N#(79 Q:
MZ+KL]:!:QE2Y9E;NWTY8W\<:#'*UKN[[/M6HP2AJ,O;]B+'=9) QB,J<J%IM
M@P6DN3R_IMK^3J@,6JC!<+5F/OA]_,9@]6'2;\P-\(<T]M9^=3C>>)VAB25#
MR]S"FCD373?"[S,?-&A8!JL/D^75CUGT54O]X '6OFY5[;\K]C4V74AYWK_8
MY+W"A2<Y<V>OH.QWDY"[9P)Q(#GB!UZ<O'KS_-2(6QX9RK(-@[G#,"YC =$D
M7^VUF>@AD]=U2V0/B?E'QGS3X++6NC<@!A<Y3:X(/PC78;6T-G]MT;$/#19,
M_^MEJL$IB\')CR%437,50 O]^4><W)DS=8-!QJ2MFY25N7+W_K6H5=7)UV^K
M>"D"]_DM#Y/8S,Z*([M]8$@W[8[=,(6K8^[5%*(R%8D.S6U#Z=CU(W/KLZ9*
M.E1A_=!0+D%4+7.H&@:-=$UE\2!<IC8Q&"I8V^827'MANOQD*Q&IXUG##%+M
MZ^W.V[E"LM#*9_M[N^NW\/5/SOJ/N(<O9N-X81,?T75$Z#"4RUN!9'V]05IO
MB:5-W*& $ ? 74CX7;(+KJ#GH4@\M4=U_2Y /2#5H]B!FNQKB=%>C/E7[M1;
M(DE;NV?;]\"ZU1OOOGIO[#W;IY'@'7<^P8E*5_!2IRMXP](0[R5T8=O9@6<B
MFDI_Y"70.#I"4VO6ZQVU_30#ZXMA,D%+@!<B#5U&VV<Q"8*/UAGX#@]C-*-=
M8*B'2&WGOPJX7:2O!IF/\:>&?6#7?X)B%[0VBP61QY IU!K@Z*. )YPHT362
M1;Q%F/@VA*<@VZUFHX53B^TS)@%S.O&_LPM_^*$K)O&>S_:;>^/XUH'&?@,]
MQJ6-EZ D5D3G)4G4W=O+DWJ6XS'=5VO/>73U/7<"'_T;7I,8]=9P5%[=/CQ$
M;>W;^S:.:J[$5_\\PSL9D1SJ2IN'-IP$ :C'&%%XS.4M=^WJ87F/-9K7;U]9
MZK,2\#AS<2#:B=4.998(6;*=XMWO,1OQ[JH:+-O[2YS;9_1!QT>A=WI_@IX*
M-NK3DOBX"OL,I-@,8%T)D2@L:(@>].COL?*1D8^%':C6B8]"IGW4.&H>NA2*
M1!G1ZA_MX';YD*4!&K[BE1!6"@)Y6N*'?O?PA*[Y+5@2T"-M'A=0D>T1.OW]
MR8PER5U?<H="MA\^A*TXXHX_]-77/DNA9HDE%WJ:CI#3&5\Y2P4+S!ESLN\[
MT(8*Y#;C<$8,)I[O>,M8AQ@YZ0N+D#L\CIF<KAN!'Z)GE,F\4HW9AQP+IB<(
M*9)A:2+&&#0=%@1K*6#\NA(88,IJP_!)!8C*CQ0!< JSCM^"KRUB4S4"B*&2
MZ3!%KN!/G"-I12X ;2;EF&H3)<^K*3#4$7/*EG#.8S1>+)ZJXYPKG$>+=(C^
ME-#'*J7YE-%(ALCUE"=5;&$Z&9%^'XTQV=<$/!Y$]JH06YLS\3F+BE_@]<FY
MJA<!]<9*FEH ('ORA],5@%66DT'5\ <9 E0L870)'I;AK1L^C='5./3RJTL5
M"6L0""<K5+3!Y<]+"%2;^B9FCH%N$8-JW0 Z(LM=I!_'J X7,<RXR]N6N9\!
M+\#5T(O]6[1M0C"#A6T,'*X_'&*I 4,IQJMH[I095-)#Q>BP?$D.1@341Y;9
MV*HEC$^5PE?#V_T7JOBV3[%T5D%T6:4JL-34J,2MCW,%YKKJHTT69!EAB62 
M/E($P2'S29Y \"X2<;Q<#UH.EUC@* MR_3@*V!2H"6,,?60:PW:*O$Q\S(NY
MB1+W.9=EZ24Q@]Y%_^3R]_,WQX2S8%0X[T(#8..(0JTGI)],E^&)NL9!5Y?*
M;18M0S7DFL!NB^R6L*$L[J;0\P3Z-(H0J[CX^'.W1\Y]_$6)"A^KR@Z]&CM!
MUDD-D7KM K='MNYHZXXVQI1NH[G?6D5+NP7]G>E]T2<*!+=?7ER\IU*]_^[9
M;_VR(#,U2AWE=88@=/.H3T@=.8T2,9(LPKRI$./D(C<!>0]*!=S+^<M;%<ZR
MM\6KV7@0%_1Y)(Q9R$:4$N\)"W-*1>[F\:""370X4WQ25M#63C[.$EH$N)]:
MD=<91"6S9*WFN5UTV0J"BPPOPE1R/';-\SNF,FZ$Y;(_*JP>E"D6)5R$NH?I
MI=( ;8@R/%B4N!^K/"C>_9:13%5=4'R6L_/9ZA%]##4Z5GQ9;-%5 +7U].6E
M^E[V^(MMVV"][E$5EG>J9"04DQ RK'&)DYJR#<G_K-5^U3-)7C *?)+.%M\7
M@$A0C@QJM6=T54P7DM_F$1\C?9*6*QZ4>8C1+T%@?3%W\41@W!6)IXT%"_$R
MJ,MI=0.SRCD?BUL.F/)PRJ 2^^JP4K/X':D*09ZKB\+PB)[*P!2$X\05Y;1:
MLW""C9@1O,]Q+J)XI<ZZR/!E/@''T98AR=80[L+#0E;976Z[0A>0@ )BN6+*
MP/H@!P1_I2ZHXP+?VXZ'<_4=PL3@6?\<91X%TS(.Y-$)1(CBFIT8@=V)<R6V
M%=U52>225EDX*E92Y=Y8;86)H]3XGBY)EEJ")5Z5<I9KI)H5\V"H$<Q,#RM7
M;,P*L (6%3)F"YC(V!*VO*HL\E]52M;FM?.'O')>I*F$7.5:+TF+50ZNX\WG
MDI>7EJFPO.C62B#:ZNZAO13>TA G<C?->OVQ0ENV?@1S0A\M##T4B?X-EJ6C
MT%,5GSY1XYU-_3[:H[\^P=3&2KJ(;OL%U0.D&#_4?H[@NS1G7J!@*4GLK%IC
MW^08BHMW[][T"^=0+!T2<?#_(R(*1T3HN[5G1.B1ZLYJX5 =$*'^U!N5!T0T
M6^7S(?(Y&R4*+!F&/LUOZ(@&N+N[:\)3:)2/AX![?RM.AJ U$Y\'+F3,*:1J
M$8G*;]ILIV8G01X['^G@!FV+C_;61__]EF]]EIS+_%N?#?8/S$>?)CY=J:T$
M6'CU*>B_$;1(V6>HZ<K] QOOU&J;VY!!&_<:AC8!UN=?G?W==Y>ZKK,P4EE\
M'"53W9BMCBXT+;?0RJ2E,P?>Z^'H6QR49&%,85[-_KO0.FQTQB6[(4\E;D #
MD8\:2V4#.J!KX(<NO[/IDOB-/7PP9_C)%B;<Q5LM""4?J1=$GVQM$9.4P%)5
MV^K-+KHP48NS@E9^R531$[G*B%T%LO" Y _"<5(IT?DF'E6>&49\G%"E2(&2
MSO@J#9VY+*)=P#.O5\SES71\5K?9TL??&*&WN:@SVLUO35R=(#:O!!0;1X>*
M"RPL)O1'690V>AN5VMMCQ[T]=43;GCZN;4^=W?8?4$L! A0#"@    @ C7U\
M.)?@6H%W#0  PDT  !(              *2!     &5X96-U=&EO;E]L;V<N
::'1M;%!+!08      0 ! $    "G#0     ! 
end


Mime
View raw message