harmony-alerts mailing list archives

Site index · List index
Message view « Date » · « Thread »
Top « Date » · « Thread »
From nom...@intel.com
Subject [build-test alert] FAILED Linux x86: drlvm-test debug
Date Thu, 20 Mar 2008 21:38:50 GMT

BUILD FAILED:
	Ant Error Message:
/export/users/cc/cc-common/scripts/cc-exec-adaptor.xml:104: The following error occurred while executing this line: /export/users/cc/cc-common/adaptors/drlvm-test/adaptor.xml:70: There were drlvm-test failures

Date of build:	2008-03-21 01:27:35 +0600
Time to build:	131 minutes 2 seconds
Last changed:	03/20/2008 23:36:17
Last log entry:	hdk

***********************************************************
Errors/Warnings:	(33)
            
[java] Java Result: 139
[java] Java Result: 139
[java] Java Result: 1
[java] Java Result: 1
[java] Java Result: 130
[java] Java Result: 139
[java] Java Result: 139
[java] Java Result: 1
[java] Java Result: 1
[java] Java Result: 130
[java] Java Result: 139
[java] Java Result: 139
[java] Java Result: 1
[java] Java Result: 1
[java] Java Result: 130
[java] Java Result: 1
[java] Java Result: 1
[java] Java Result: 130
[java] Java Result: 139
[java] Java Result: 139
[java] Java Result: 1
[java] Java Result: 1
[java] Java Result: 130
[java] Java Result: 139
[java] Java Result: 139
[java] Java Result: 1
[java] Java Result: 1
[java] Java Result: 130
BUILD FAILED
/export/users/cc/cc-common/build/checkouts/hdk/working_vm/build.xml:285: Some tests failed
Total time: 130 minutes 48 seconds
The execution FAILED with the following exception:
The following error occurred while executing this line:
/export/users/cc/cc-common/adaptors/drlvm-test/adaptor.xml:70: There were drlvm-test failures

***********************************************************
Unit Tests: (5034)
        
failure: Default mode since gc_cc is no more StackTest_gc_cc
failure: jitrino.JET StackTest_jet
failure: Client mode JIT (default) StackTest_jit
failure: jitrino.OPT StackTest_opt
failure: Server mode JIT StackTest_srv
failure: Default mode since gc_cc is no more exception.FinalizeStackTest_gc_cc
failure: jitrino.JET exception.FinalizeStackTest_jet
failure: Client mode JIT (default) exception.FinalizeStackTest_jit
failure: jitrino.OPT exception.FinalizeStackTest_opt
failure: Server mode JIT exception.FinalizeStackTest_srv
Unit Test Error Details:	(10)
                
Test: Default mode since gc_cc is no moreClass: StackTest_gc_ccExit code: 139 Err: 
Signal reported: GENERAL_PROTECTION_FAULT
Registers:
    EAX: 0xbf063f3c, EBX: 0xb7128604, ECX: 0xbf062d0c, EDX: 0xa58d5650
    ESI: 0xbf84f240, EDI: 0xbf851d41, ESP: 0xbf062bf4, EBP: 0xbf062c18
    EIP: 0xb711fd3e

Command line:
/export/users/cc/cc-common/build/checkouts/hdk/working_vm/build/linux_x86_gcc_debug/deploy/jdk/jre/bin/java -XX:-vm.assert_dialog -Djava.library.path=/export/users/cc/cc-common/build/checkouts/hdk/working_vm/build/linux_x86_gcc_debug/tests/smoke.tests/natives/smoke -classpath /export/users/cc/cc-common/build/checkouts/hdk/working_vm/build/linux_x86_gcc_debug/tests/smoke.tests/classes StackTest 

Working directory:
/export/users/cc/cc-common/build/checkouts/hdk/working_vm/build/linux_x86_gcc_debug/tests/smoke.tests

Environment variables:
JAVA_HOME=/export/users/cc/cc-common/build/checkouts/hdk/working_vm/build/linux_x86_gcc_debug/deploy/jdk/jre
LD_LIBRARY_PATH=/export/users/cc/cc-common/build/checkouts/hdk/working_vm/build/linux_x86_gcc_debug/deploy/jdk/jre/bin/default:/export/users/cc/cc-common/build/checkouts/hdk/working_vm/build/linux_x86_gcc_debug/deploy/jdk/jre/bin/:/export/users/cc/cc-common/build/checkouts/hdk/working_vm/build/linux_x86_gcc_debug/deploy/jdk/jre/bin:/export/users/cc/jdk1.5.0_06_Sun/jre/lib/i386/server:/export/users/cc/jdk1.5.0_06_Sun/jre/lib/i386:/export/users/cc/jdk1.5.0_06_Sun/jre/../lib/i386

Loaded modules:

/export/users/cc/cc-common/build/checkouts/hdk/working_vm/build/linux_x86_gcc_debug/deploy/jdk/jre/bin/java:
	0x08048000:0x0804e000
	0x0804e000:0x0804f000
[heap]:
	0x0804f000:0x086b9000
/export/users/cc/cc-common/build/checkouts/hdk/working_vm/build/linux_x86_gcc_debug/deploy/jdk/jre/bin/libhycharset.so:
	0xa5915000:0xa5a66000
	0xa5a66000:0xa5a8e000
/export/users/cc/cc-common/build/checkouts/hdk/working_vm/build/linux_x86_gcc_debug/deploy/jdk/jre/bin/libhyarchive.so:
	0xa5a8e000:0xa5a9a000
	0xa5a9a000:0xa5a9b000
/export/users/cc/cc-common/build/checkouts/hdk/working_vm/build/linux_x86_gcc_debug/deploy/jdk/jre/bin/libhyluni.so:
	0xa5abf000:0xa5af2000
	0xa5af2000:0xa5af3000
/export/users/cc/cc-common/build/checkouts/hdk/working_vm/build/linux_x86_gcc_debug/deploy/jdk/jre/bin/default/libvmi.so:
	0xa5af3000:0xa5af8000
	0xa5af8000:0xa5af9000
/export/users/cc/cc-common/build/checkouts/hdk/working_vm/build/linux_x86_gcc_debug/deploy/jdk/jre/bin/libhynio.so:
	0xa5af9000:0xa5afb000
	0xa5afb000:0xa5afc000
/export/users/cc/cc-common/build/checkouts/hdk/working_vm/build/linux_x86_gcc_debug/deploy/jdk/jre/bin/libhyzlib.so:
	0xa5afc000:0xa5b0e000
	0xa5b0e000:0xa5b0f000
/export/users/cc/cc-common/build/checkouts/hdk/working_vm/build/linux_x86_gcc_debug/deploy/jdk/jre/bin/default/libgc_gen_uncomp.so:
	0xb601d000:0xb60b9000
	0xb60b9000:0xb60ba000
/export/users/cc/cc-common/build/checkouts/hdk/working_vm/build/linux_x86_gcc_debug/deploy/jdk/jre/bin/default/libjitrino.so:
	0xb60bb000:0xb6452000
	0xb6452000:0xb6460000
/export/users/cc/cc-common/build/checkouts/hdk/working_vm/build/linux_x86_gcc_debug/deploy/jdk/jre/bin/default/libem.so:
	0xb64bb000:0xb64f4000
	0xb64f4000:0xb64f5000
/var/run/nscd/passwd:
	0xb6575000:0xb65aa000
/usr/lib/libstdc++.so.5.0.7:
	0xb66ac000:0xb6760000
	0xb6760000:0xb6765000
/export/users/cc/cc-common/build/checkouts/hdk/working_vm/build/linux_x86_gcc_debug/deploy/jdk/jre/bin/default/libicudata.so.34:
	0xb676a000:0xb6fd8000
	0xb6fd8000:0xb6fd9000
/usr/lib/libxml2.so.2.6.23:
	0xb6fd9000:0xb70ff000
	0xb70ff000:0xb7108000
/lib/libz.so.1.2.3:
	0xb7109000:0xb711a000
	0xb711a000:0xb711b000
/export/users/cc/cc-common/build/checkouts/hdk/working_vm/build/linux_x86_gcc_debug/deploy/jdk/jre/bin/default/libch.so:
	0xb711b000:0xb7128000
	0xb7128000:0xb717f000
/export/users/cc/cc-common/build/checkouts/hdk/working_vm/build/linux_x86_gcc_debug/deploy/jdk/jre/bin/default/libicuuc.so.34:
	0xb7387000:0xb7477000
	0xb7477000:0xb747e000
/export/users/cc/cc-common/build/checkouts/hdk/working_vm/build/linux_x86_gcc_debug/deploy/jdk/jre/bin/default/libharmonyvm.so:
	0xb747e000:0xb77c2000
	0xb77c2000:0xb781d000
/lib/libgcc_s.so.1:
	0xb7aac000:0xb7ab6000
	0xb7ab6000:0xb7ab7000
/lib/libpthread-2.4.so:
	0xb7ab7000:0xb7ac7000
	0xb7ac7000:0xb7ac9000
/lib/librt-2.4.so:
	0xb7acc000:0xb7ad3000
	0xb7ad3000:0xb7ad5000
/usr/lib/libstdc++.so.6.0.8:
	0xb7ad5000:0xb7baa000
	0xb7baa000:0xb7bad000
	0xb7bad000:0xb7baf000
/lib/libdl-2.4.so:
	0xb7bb5000:0xb7bb7000
	0xb7bb7000:0xb7bb9000
/lib/libm-2.4.so:
	0xb7bb9000:0xb7bdc000
	0xb7bdc000:0xb7bde000
/lib/libc-2.4.so:
	0xb7bde000:0xb7cf7000
	0xb7cf7000:0xb7cf9000
	0xb7cf9000:0xb7cfb000
/export/users/cc/cc-common/build/checkouts/hdk/working_vm/build/linux_x86_gcc_debug/deploy/jdk/jre/bin/libhyprt.so:
	0xb7d22000:0xb7d3d000
	0xb7d3d000:0xb7d41000
/export/users/cc/cc-common/build/checkouts/hdk/working_vm/build/linux_x86_gcc_debug/deploy/jdk/jre/bin/libhysig.so:
	0xb7d44000:0xb7d46000
	0xb7d46000:0xb7d47000
/export/users/cc/cc-common/build/checkouts/hdk/working_vm/build/linux_x86_gcc_debug/deploy/jdk/jre/bin/default/libhythr.so:
	0xb7d47000:0xb7ecd000
	0xb7ecd000:0xb7ece000
/lib/ld-2.4.so:
	0xb7f01000:0xb7f1b000
	0xb7f1b000:0xb7f1d000
[stack]:
	0xbf064000:0xbf850000
[vdso]:
	0xffffe000:0xfffff000

Stack trace:
  0: port_set_longjump_regs (signals_ia32.cpp:38)
<end of stack trace>

Crashed module:
/export/users/cc/cc-common/build/checkouts/hdk/working_vm/build/linux_x86_gcc_debug/deploy/jdk/jre/bin/default/libch.so
(Unknown/system native module)

VM attached threads:

    [0xa54fbba0]  'ref handler'
    [0xa557cba0]  'finalizer'
    [0xa55fdba0]  'finalizer'
    [0xa567eba0]  'finalizer'
    [0xa56ffba0]  'finalizer'
    [0xa58d4ba0]  'profiler thread'
--->[0xb7aabb80]  'main'
Test: jitrino.JETClass: StackTest_jetExit code: 139 Err: 
Signal reported: GENERAL_PROTECTION_FAULT
Registers:
    EAX: 0xbf1b0f7c, EBX: 0xb7149604, ECX: 0xbf1afd0c, EDX: 0xa58f6640
    ESI: 0xbf99bb80, EDI: 0xbf99cd41, ESP: 0xbf1afbf4, EBP: 0xbf1afc18
    EIP: 0xb7140d3e

Command line:
/export/users/cc/cc-common/build/checkouts/hdk/working_vm/build/linux_x86_gcc_debug/deploy/jdk/jre/bin/java -Xem:jet -XX:-vm.assert_dialog -Djava.library.path=/export/users/cc/cc-common/build/checkouts/hdk/working_vm/build/linux_x86_gcc_debug/tests/smoke.tests/natives/smoke -classpath /export/users/cc/cc-common/build/checkouts/hdk/working_vm/build/linux_x86_gcc_debug/tests/smoke.tests/classes StackTest 

Working directory:
/export/users/cc/cc-common/build/checkouts/hdk/working_vm/build/linux_x86_gcc_debug/tests/smoke.tests

Environment variables:
JAVA_HOME=/export/users/cc/cc-common/build/checkouts/hdk/working_vm/build/linux_x86_gcc_debug/deploy/jdk/jre
LD_LIBRARY_PATH=/export/users/cc/cc-common/build/checkouts/hdk/working_vm/build/linux_x86_gcc_debug/deploy/jdk/jre/bin/default:/export/users/cc/cc-common/build/checkouts/hdk/working_vm/build/linux_x86_gcc_debug/deploy/jdk/jre/bin/:/export/users/cc/cc-common/build/checkouts/hdk/working_vm/build/linux_x86_gcc_debug/deploy/jdk/jre/bin:/export/users/cc/jdk1.5.0_06_Sun/jre/lib/i386/server:/export/users/cc/jdk1.5.0_06_Sun/jre/lib/i386:/export/users/cc/jdk1.5.0_06_Sun/jre/../lib/i386

Loaded modules:

/export/users/cc/cc-common/build/checkouts/hdk/working_vm/build/linux_x86_gcc_debug/deploy/jdk/jre/bin/java:
	0x08048000:0x0804e000
	0x0804e000:0x0804f000
[heap]:
	0x0804f000:0x0874b000
/export/users/cc/cc-common/build/checkouts/hdk/working_vm/build/linux_x86_gcc_debug/deploy/jdk/jre/bin/libhycharset.so:
	0xa5936000:0xa5a87000
	0xa5a87000:0xa5aaf000
/export/users/cc/cc-common/build/checkouts/hdk/working_vm/build/linux_x86_gcc_debug/deploy/jdk/jre/bin/libhyarchive.so:
	0xa5aaf000:0xa5abb000
	0xa5abb000:0xa5abc000
/export/users/cc/cc-common/build/checkouts/hdk/working_vm/build/linux_x86_gcc_debug/deploy/jdk/jre/bin/libhyluni.so:
	0xa5ae0000:0xa5b13000
	0xa5b13000:0xa5b14000
/export/users/cc/cc-common/build/checkouts/hdk/working_vm/build/linux_x86_gcc_debug/deploy/jdk/jre/bin/default/libvmi.so:
	0xa5b14000:0xa5b19000
	0xa5b19000:0xa5b1a000
/export/users/cc/cc-common/build/checkouts/hdk/working_vm/build/linux_x86_gcc_debug/deploy/jdk/jre/bin/libhynio.so:
	0xa5b1a000:0xa5b1c000
	0xa5b1c000:0xa5b1d000
/export/users/cc/cc-common/build/checkouts/hdk/working_vm/build/linux_x86_gcc_debug/deploy/jdk/jre/bin/libhyzlib.so:
	0xa5b1d000:0xa5b2f000
	0xa5b2f000:0xa5b30000
/export/users/cc/cc-common/build/checkouts/hdk/working_vm/build/linux_x86_gcc_debug/deploy/jdk/jre/bin/default/libgc_gen_uncomp.so:
	0xb603e000:0xb60da000
	0xb60da000:0xb60db000
/export/users/cc/cc-common/build/checkouts/hdk/working_vm/build/linux_x86_gcc_debug/deploy/jdk/jre/bin/default/libjitrino.so:
	0xb60dc000:0xb6473000
	0xb6473000:0xb6481000
/export/users/cc/cc-common/build/checkouts/hdk/working_vm/build/linux_x86_gcc_debug/deploy/jdk/jre/bin/default/libem.so:
	0xb64dc000:0xb6515000
	0xb6515000:0xb6516000
/var/run/nscd/passwd:
	0xb6596000:0xb65cb000
/usr/lib/libstdc++.so.5.0.7:
	0xb66cd000:0xb6781000
	0xb6781000:0xb6786000
/export/users/cc/cc-common/build/checkouts/hdk/working_vm/build/linux_x86_gcc_debug/deploy/jdk/jre/bin/default/libicudata.so.34:
	0xb678b000:0xb6ff9000
	0xb6ff9000:0xb6ffa000
/usr/lib/libxml2.so.2.6.23:
	0xb6ffa000:0xb7120000
	0xb7120000:0xb7129000
/lib/libz.so.1.2.3:
	0xb712a000:0xb713b000
	0xb713b000:0xb713c000
/export/users/cc/cc-common/build/checkouts/hdk/working_vm/build/linux_x86_gcc_debug/deploy/jdk/jre/bin/default/libch.so:
	0xb713c000:0xb7149000
	0xb7149000:0xb71a0000
/export/users/cc/cc-common/build/checkouts/hdk/working_vm/build/linux_x86_gcc_debug/deploy/jdk/jre/bin/default/libicuuc.so.34:
	0xb73a8000:0xb7498000
	0xb7498000:0xb749f000
/export/users/cc/cc-common/build/checkouts/hdk/working_vm/build/linux_x86_gcc_debug/deploy/jdk/jre/bin/default/libharmonyvm.so:
	0xb749f000:0xb77e3000
	0xb77e3000:0xb783e000
/lib/libgcc_s.so.1:
	0xb7acd000:0xb7ad7000
	0xb7ad7000:0xb7ad8000
/lib/libpthread-2.4.so:
	0xb7ad8000:0xb7ae8000
	0xb7ae8000:0xb7aea000
/lib/librt-2.4.so:
	0xb7aed000:0xb7af4000
	0xb7af4000:0xb7af6000
/usr/lib/libstdc++.so.6.0.8:
	0xb7af6000:0xb7bcb000
	0xb7bcb000:0xb7bce000
	0xb7bce000:0xb7bd0000
/lib/libdl-2.4.so:
	0xb7bd6000:0xb7bd8000
	0xb7bd8000:0xb7bda000
/lib/libm-2.4.so:
	0xb7bda000:0xb7bfd000
	0xb7bfd000:0xb7bff000
/lib/libc-2.4.so:
	0xb7bff000:0xb7d18000
	0xb7d18000:0xb7d1a000
	0xb7d1a000:0xb7d1c000
/export/users/cc/cc-common/build/checkouts/hdk/working_vm/build/linux_x86_gcc_debug/deploy/jdk/jre/bin/libhyprt.so:
	0xb7d43000:0xb7d5e000
	0xb7d5e000:0xb7d62000
/export/users/cc/cc-common/build/checkouts/hdk/working_vm/build/linux_x86_gcc_debug/deploy/jdk/jre/bin/libhysig.so:
	0xb7d65000:0xb7d67000
	0xb7d67000:0xb7d68000
/export/users/cc/cc-common/build/checkouts/hdk/working_vm/build/linux_x86_gcc_debug/deploy/jdk/jre/bin/default/libhythr.so:
	0xb7d68000:0xb7eee000
	0xb7eee000:0xb7eef000
/lib/ld-2.4.so:
	0xb7f22000:0xb7f3c000
	0xb7f3c000:0xb7f3e000
[stack]:
	0xbf1b1000:0xbf99d000
[vdso]:
	0xffffe000:0xfffff000

Stack trace:
  0: port_set_longjump_regs (signals_ia32.cpp:38)
<end of stack trace>

Crashed module:
/export/users/cc/cc-common/build/checkouts/hdk/working_vm/build/linux_x86_gcc_debug/deploy/jdk/jre/bin/default/libch.so
(Unknown/system native module)

VM attached threads:

    [0xa56f1ba0]  'ref handler'
    [0xa5772ba0]  'finalizer'
    [0xa57f3ba0]  'finalizer'
    [0xa5874ba0]  'finalizer'
    [0xa58f5ba0]  'finalizer'
--->[0xb7accb80]  'main'
Test: Client mode JIT (default)Class: StackTest_jitExit code: 139 Err: 
Signal reported: GENERAL_PROTECTION_FAULT
Registers:
    EAX: 0xbf36af3c, EBX: 0xb71cf604, ECX: 0xbf369d0c, EDX: 0xa597c650
    ESI: 0xbfb56540, EDI: 0xbfb57d41, ESP: 0xbf369bf4, EBP: 0xbf369c18
    EIP: 0xb71c6d3e

Command line:
/export/users/cc/cc-common/build/checkouts/hdk/working_vm/build/linux_x86_gcc_debug/deploy/jdk/jre/bin/java -XX:-vm.assert_dialog -Djava.library.path=/export/users/cc/cc-common/build/checkouts/hdk/working_vm/build/linux_x86_gcc_debug/tests/smoke.tests/natives/smoke -classpath /export/users/cc/cc-common/build/checkouts/hdk/working_vm/build/linux_x86_gcc_debug/tests/smoke.tests/classes StackTest 

Working directory:
/export/users/cc/cc-common/build/checkouts/hdk/working_vm/build/linux_x86_gcc_debug/tests/smoke.tests

Environment variables:
JAVA_HOME=/export/users/cc/cc-common/build/checkouts/hdk/working_vm/build/linux_x86_gcc_debug/deploy/jdk/jre
LD_LIBRARY_PATH=/export/users/cc/cc-common/build/checkouts/hdk/working_vm/build/linux_x86_gcc_debug/deploy/jdk/jre/bin/default:/export/users/cc/cc-common/build/checkouts/hdk/working_vm/build/linux_x86_gcc_debug/deploy/jdk/jre/bin/:/export/users/cc/cc-common/build/checkouts/hdk/working_vm/build/linux_x86_gcc_debug/deploy/jdk/jre/bin:/export/users/cc/jdk1.5.0_06_Sun/jre/lib/i386/server:/export/users/cc/jdk1.5.0_06_Sun/jre/lib/i386:/export/users/cc/jdk1.5.0_06_Sun/jre/../lib/i386

Loaded modules:

/export/users/cc/cc-common/build/checkouts/hdk/working_vm/build/linux_x86_gcc_debug/deploy/jdk/jre/bin/java:
	0x08048000:0x0804e000
	0x0804e000:0x0804f000
[heap]:
	0x0804f000:0x086b9000
/export/users/cc/cc-common/build/checkouts/hdk/working_vm/build/linux_x86_gcc_debug/deploy/jdk/jre/bin/libhycharset.so:
	0xa59bc000:0xa5b0d000
	0xa5b0d000:0xa5b35000
/export/users/cc/cc-common/build/checkouts/hdk/working_vm/build/linux_x86_gcc_debug/deploy/jdk/jre/bin/libhyarchive.so:
	0xa5b35000:0xa5b41000
	0xa5b41000:0xa5b42000
/export/users/cc/cc-common/build/checkouts/hdk/working_vm/build/linux_x86_gcc_debug/deploy/jdk/jre/bin/libhyluni.so:
	0xa5b66000:0xa5b99000
	0xa5b99000:0xa5b9a000
/export/users/cc/cc-common/build/checkouts/hdk/working_vm/build/linux_x86_gcc_debug/deploy/jdk/jre/bin/default/libvmi.so:
	0xa5b9a000:0xa5b9f000
	0xa5b9f000:0xa5ba0000
/export/users/cc/cc-common/build/checkouts/hdk/working_vm/build/linux_x86_gcc_debug/deploy/jdk/jre/bin/libhynio.so:
	0xa5ba0000:0xa5ba2000
	0xa5ba2000:0xa5ba3000
/export/users/cc/cc-common/build/checkouts/hdk/working_vm/build/linux_x86_gcc_debug/deploy/jdk/jre/bin/libhyzlib.so:
	0xa5ba3000:0xa5bb5000
	0xa5bb5000:0xa5bb6000
/export/users/cc/cc-common/build/checkouts/hdk/working_vm/build/linux_x86_gcc_debug/deploy/jdk/jre/bin/default/libgc_gen_uncomp.so:
	0xb60c4000:0xb6160000
	0xb6160000:0xb6161000
/export/users/cc/cc-common/build/checkouts/hdk/working_vm/build/linux_x86_gcc_debug/deploy/jdk/jre/bin/default/libjitrino.so:
	0xb6162000:0xb64f9000
	0xb64f9000:0xb6507000
/export/users/cc/cc-common/build/checkouts/hdk/working_vm/build/linux_x86_gcc_debug/deploy/jdk/jre/bin/default/libem.so:
	0xb6562000:0xb659b000
	0xb659b000:0xb659c000
/var/run/nscd/passwd:
	0xb661c000:0xb6651000
/usr/lib/libstdc++.so.5.0.7:
	0xb6753000:0xb6807000
	0xb6807000:0xb680c000
/export/users/cc/cc-common/build/checkouts/hdk/working_vm/build/linux_x86_gcc_debug/deploy/jdk/jre/bin/default/libicudata.so.34:
	0xb6811000:0xb707f000
	0xb707f000:0xb7080000
/usr/lib/libxml2.so.2.6.23:
	0xb7080000:0xb71a6000
	0xb71a6000:0xb71af000
/lib/libz.so.1.2.3:
	0xb71b0000:0xb71c1000
	0xb71c1000:0xb71c2000
/export/users/cc/cc-common/build/checkouts/hdk/working_vm/build/linux_x86_gcc_debug/deploy/jdk/jre/bin/default/libch.so:
	0xb71c2000:0xb71cf000
	0xb71cf000:0xb7226000
/export/users/cc/cc-common/build/checkouts/hdk/working_vm/build/linux_x86_gcc_debug/deploy/jdk/jre/bin/default/libicuuc.so.34:
	0xb742e000:0xb751e000
	0xb751e000:0xb7525000
/export/users/cc/cc-common/build/checkouts/hdk/working_vm/build/linux_x86_gcc_debug/deploy/jdk/jre/bin/default/libharmonyvm.so:
	0xb7525000:0xb7869000
	0xb7869000:0xb78c4000
/lib/libgcc_s.so.1:
	0xb7b53000:0xb7b5d000
	0xb7b5d000:0xb7b5e000
/lib/libpthread-2.4.so:
	0xb7b5e000:0xb7b6e000
	0xb7b6e000:0xb7b70000
/lib/librt-2.4.so:
	0xb7b73000:0xb7b7a000
	0xb7b7a000:0xb7b7c000
/usr/lib/libstdc++.so.6.0.8:
	0xb7b7c000:0xb7c51000
	0xb7c51000:0xb7c54000
	0xb7c54000:0xb7c56000
/lib/libdl-2.4.so:
	0xb7c5c000:0xb7c5e000
	0xb7c5e000:0xb7c60000
/lib/libm-2.4.so:
	0xb7c60000:0xb7c83000
	0xb7c83000:0xb7c85000
/lib/libc-2.4.so:
	0xb7c85000:0xb7d9e000
	0xb7d9e000:0xb7da0000
	0xb7da0000:0xb7da2000
/export/users/cc/cc-common/build/checkouts/hdk/working_vm/build/linux_x86_gcc_debug/deploy/jdk/jre/bin/libhyprt.so:
	0xb7dc9000:0xb7de4000
	0xb7de4000:0xb7de8000
/export/users/cc/cc-common/build/checkouts/hdk/working_vm/build/linux_x86_gcc_debug/deploy/jdk/jre/bin/libhysig.so:
	0xb7deb000:0xb7ded000
	0xb7ded000:0xb7dee000
/export/users/cc/cc-common/build/checkouts/hdk/working_vm/build/linux_x86_gcc_debug/deploy/jdk/jre/bin/default/libhythr.so:
	0xb7dee000:0xb7f74000
	0xb7f74000:0xb7f75000
/lib/ld-2.4.so:
	0xb7fa8000:0xb7fc2000
	0xb7fc2000:0xb7fc4000
[stack]:
	0xbf36b000:0xbfb57000
[vdso]:
	0xffffe000:0xfffff000

Stack trace:
  0: port_set_longjump_regs (signals_ia32.cpp:38)
<end of stack trace>

Crashed module:
/export/users/cc/cc-common/build/checkouts/hdk/working_vm/build/linux_x86_gcc_debug/deploy/jdk/jre/bin/default/libch.so
(Unknown/system native module)

VM attached threads:

    [0xa557cba0]  'ref handler'
    [0xa55fdba0]  'finalizer'
    [0xa567eba0]  'finalizer'
    [0xa56ffba0]  'finalizer'
    [0xa58faba0]  'finalizer'
    [0xa597bba0]  'profiler thread'
--->[0xb7b52b80]  'main'
Test: jitrino.OPTClass: StackTest_optExit code: 139 Err: 
Signal reported: GENERAL_PROTECTION_FAULT
Registers:
    EAX: 0xbf0c1ffc, EBX: 0xb713e604, ECX: 0xbf0c0d0c, EDX: 0xa58eb240
    ESI: 0xbf8ad290, EDI: 0xbf8afd41, ESP: 0xbf0c0bf4, EBP: 0xbf0c0c18
    EIP: 0xb7135d3e

Command line:
/export/users/cc/cc-common/build/checkouts/hdk/working_vm/build/linux_x86_gcc_debug/deploy/jdk/jre/bin/java -Xem:opt -XX:-vm.assert_dialog -Djava.library.path=/export/users/cc/cc-common/build/checkouts/hdk/working_vm/build/linux_x86_gcc_debug/tests/smoke.tests/natives/smoke -classpath /export/users/cc/cc-common/build/checkouts/hdk/working_vm/build/linux_x86_gcc_debug/tests/smoke.tests/classes StackTest 

Working directory:
/export/users/cc/cc-common/build/checkouts/hdk/working_vm/build/linux_x86_gcc_debug/tests/smoke.tests

Environment variables:
JAVA_HOME=/export/users/cc/cc-common/build/checkouts/hdk/working_vm/build/linux_x86_gcc_debug/deploy/jdk/jre
LD_LIBRARY_PATH=/export/users/cc/cc-common/build/checkouts/hdk/working_vm/build/linux_x86_gcc_debug/deploy/jdk/jre/bin/default:/export/users/cc/cc-common/build/checkouts/hdk/working_vm/build/linux_x86_gcc_debug/deploy/jdk/jre/bin/:/export/users/cc/cc-common/build/checkouts/hdk/working_vm/build/linux_x86_gcc_debug/deploy/jdk/jre/bin:/export/users/cc/jdk1.5.0_06_Sun/jre/lib/i386/server:/export/users/cc/jdk1.5.0_06_Sun/jre/lib/i386:/export/users/cc/jdk1.5.0_06_Sun/jre/../lib/i386

Loaded modules:

/export/users/cc/cc-common/build/checkouts/hdk/working_vm/build/linux_x86_gcc_debug/deploy/jdk/jre/bin/java:
	0x08048000:0x0804e000
	0x0804e000:0x0804f000
[heap]:
	0x0804f000:0x08965000
/export/users/cc/cc-common/build/checkouts/hdk/working_vm/build/linux_x86_gcc_debug/deploy/jdk/jre/bin/libhycharset.so:
	0xa592b000:0xa5a7c000
	0xa5a7c000:0xa5aa4000
/export/users/cc/cc-common/build/checkouts/hdk/working_vm/build/linux_x86_gcc_debug/deploy/jdk/jre/bin/libhyarchive.so:
	0xa5aa4000:0xa5ab0000
	0xa5ab0000:0xa5ab1000
/export/users/cc/cc-common/build/checkouts/hdk/working_vm/build/linux_x86_gcc_debug/deploy/jdk/jre/bin/libhyluni.so:
	0xa5ad5000:0xa5b08000
	0xa5b08000:0xa5b09000
/export/users/cc/cc-common/build/checkouts/hdk/working_vm/build/linux_x86_gcc_debug/deploy/jdk/jre/bin/default/libvmi.so:
	0xa5b09000:0xa5b0e000
	0xa5b0e000:0xa5b0f000
/export/users/cc/cc-common/build/checkouts/hdk/working_vm/build/linux_x86_gcc_debug/deploy/jdk/jre/bin/libhynio.so:
	0xa5b0f000:0xa5b11000
	0xa5b11000:0xa5b12000
/export/users/cc/cc-common/build/checkouts/hdk/working_vm/build/linux_x86_gcc_debug/deploy/jdk/jre/bin/libhyzlib.so:
	0xa5b12000:0xa5b24000
	0xa5b24000:0xa5b25000
/export/users/cc/cc-common/build/checkouts/hdk/working_vm/build/linux_x86_gcc_debug/deploy/jdk/jre/bin/default/libgc_gen_uncomp.so:
	0xb6033000:0xb60cf000
	0xb60cf000:0xb60d0000
/export/users/cc/cc-common/build/checkouts/hdk/working_vm/build/linux_x86_gcc_debug/deploy/jdk/jre/bin/default/libjitrino.so:
	0xb60d1000:0xb6468000
	0xb6468000:0xb6476000
/export/users/cc/cc-common/build/checkouts/hdk/working_vm/build/linux_x86_gcc_debug/deploy/jdk/jre/bin/default/libem.so:
	0xb64d1000:0xb650a000
	0xb650a000:0xb650b000
/var/run/nscd/passwd:
	0xb658b000:0xb65c0000
/usr/lib/libstdc++.so.5.0.7:
	0xb66c2000:0xb6776000
	0xb6776000:0xb677b000
/export/users/cc/cc-common/build/checkouts/hdk/working_vm/build/linux_x86_gcc_debug/deploy/jdk/jre/bin/default/libicudata.so.34:
	0xb6780000:0xb6fee000
	0xb6fee000:0xb6fef000
/usr/lib/libxml2.so.2.6.23:
	0xb6fef000:0xb7115000
	0xb7115000:0xb711e000
/lib/libz.so.1.2.3:
	0xb711f000:0xb7130000
	0xb7130000:0xb7131000
/export/users/cc/cc-common/build/checkouts/hdk/working_vm/build/linux_x86_gcc_debug/deploy/jdk/jre/bin/default/libch.so:
	0xb7131000:0xb713e000
	0xb713e000:0xb7195000
/export/users/cc/cc-common/build/checkouts/hdk/working_vm/build/linux_x86_gcc_debug/deploy/jdk/jre/bin/default/libicuuc.so.34:
	0xb739d000:0xb748d000
	0xb748d000:0xb7494000
/export/users/cc/cc-common/build/checkouts/hdk/working_vm/build/linux_x86_gcc_debug/deploy/jdk/jre/bin/default/libharmonyvm.so:
	0xb7494000:0xb77d8000
	0xb77d8000:0xb7833000
/lib/libgcc_s.so.1:
	0xb7ac2000:0xb7acc000
	0xb7acc000:0xb7acd000
/lib/libpthread-2.4.so:
	0xb7acd000:0xb7add000
	0xb7add000:0xb7adf000
/lib/librt-2.4.so:
	0xb7ae2000:0xb7ae9000
	0xb7ae9000:0xb7aeb000
/usr/lib/libstdc++.so.6.0.8:
	0xb7aeb000:0xb7bc0000
	0xb7bc0000:0xb7bc3000
	0xb7bc3000:0xb7bc5000
/lib/libdl-2.4.so:
	0xb7bcb000:0xb7bcd000
	0xb7bcd000:0xb7bcf000
/lib/libm-2.4.so:
	0xb7bcf000:0xb7bf2000
	0xb7bf2000:0xb7bf4000
/lib/libc-2.4.so:
	0xb7bf4000:0xb7d0d000
	0xb7d0d000:0xb7d0f000
	0xb7d0f000:0xb7d11000
/export/users/cc/cc-common/build/checkouts/hdk/working_vm/build/linux_x86_gcc_debug/deploy/jdk/jre/bin/libhyprt.so:
	0xb7d38000:0xb7d53000
	0xb7d53000:0xb7d57000
/export/users/cc/cc-common/build/checkouts/hdk/working_vm/build/linux_x86_gcc_debug/deploy/jdk/jre/bin/libhysig.so:
	0xb7d5a000:0xb7d5c000
	0xb7d5c000:0xb7d5d000
/export/users/cc/cc-common/build/checkouts/hdk/working_vm/build/linux_x86_gcc_debug/deploy/jdk/jre/bin/default/libhythr.so:
	0xb7d5d000:0xb7ee3000
	0xb7ee3000:0xb7ee4000
/lib/ld-2.4.so:
	0xb7f17000:0xb7f31000
	0xb7f31000:0xb7f33000
[stack]:
	0xbf0c2000:0xbf8ae000
[vdso]:
	0xffffe000:0xfffff000

Stack trace:
  0: port_set_longjump_regs (signals_ia32.cpp:38)
<end of stack trace>

Crashed module:
/export/users/cc/cc-common/build/checkouts/hdk/working_vm/build/linux_x86_gcc_debug/deploy/jdk/jre/bin/default/libch.so
(Unknown/system native module)

VM attached threads:

    [0xa56e6ba0]  'ref handler'
    [0xa5767ba0]  'finalizer'
    [0xa57e8ba0]  'finalizer'
    [0xa5869ba0]  'finalizer'
    [0xa58eaba0]  'finalizer'
--->[0xb7ac1b80]  'main'
Test: Server mode JITClass: StackTest_srvExit code: 139 Err: 
Signal reported: GENERAL_PROTECTION_FAULT
Registers:
    EAX: 0xbf6e5ffc, EBX: 0xb7132604, ECX: 0xbf6e4d0c, EDX: 0xa58df330
    ESI: 0xbfed10c0, EDI: 0xa578d044, ESP: 0xbf6e4bf4, EBP: 0xbf6e4c18
    EIP: 0xb7129d3e

Command line:
/export/users/cc/cc-common/build/checkouts/hdk/working_vm/build/linux_x86_gcc_debug/deploy/jdk/jre/bin/java -server -XX:-vm.assert_dialog -Djava.library.path=/export/users/cc/cc-common/build/checkouts/hdk/working_vm/build/linux_x86_gcc_debug/tests/smoke.tests/natives/smoke -classpath /export/users/cc/cc-common/build/checkouts/hdk/working_vm/build/linux_x86_gcc_debug/tests/smoke.tests/classes StackTest 

Working directory:
/export/users/cc/cc-common/build/checkouts/hdk/working_vm/build/linux_x86_gcc_debug/tests/smoke.tests

Environment variables:
JAVA_HOME=/export/users/cc/cc-common/build/checkouts/hdk/working_vm/build/linux_x86_gcc_debug/deploy/jdk/jre
LD_LIBRARY_PATH=/export/users/cc/cc-common/build/checkouts/hdk/working_vm/build/linux_x86_gcc_debug/deploy/jdk/jre/bin/default:/export/users/cc/cc-common/build/checkouts/hdk/working_vm/build/linux_x86_gcc_debug/deploy/jdk/jre/bin/:/export/users/cc/cc-common/build/checkouts/hdk/working_vm/build/linux_x86_gcc_debug/deploy/jdk/jre/bin:/export/users/cc/jdk1.5.0_06_Sun/jre/lib/i386/server:/export/users/cc/jdk1.5.0_06_Sun/jre/lib/i386:/export/users/cc/jdk1.5.0_06_Sun/jre/../lib/i386

Loaded modules:

/export/users/cc/cc-common/build/checkouts/hdk/working_vm/build/linux_x86_gcc_debug/deploy/jdk/jre/bin/java:
	0x08048000:0x0804e000
	0x0804e000:0x0804f000
[heap]:
	0x0804f000:0x088db000
/export/users/cc/cc-common/build/checkouts/hdk/working_vm/build/linux_x86_gcc_debug/deploy/jdk/jre/bin/libhycharset.so:
	0xa591f000:0xa5a70000
	0xa5a70000:0xa5a98000
/export/users/cc/cc-common/build/checkouts/hdk/working_vm/build/linux_x86_gcc_debug/deploy/jdk/jre/bin/libhyarchive.so:
	0xa5a98000:0xa5aa4000
	0xa5aa4000:0xa5aa5000
/export/users/cc/cc-common/build/checkouts/hdk/working_vm/build/linux_x86_gcc_debug/deploy/jdk/jre/bin/libhyluni.so:
	0xa5ac9000:0xa5afc000
	0xa5afc000:0xa5afd000
/export/users/cc/cc-common/build/checkouts/hdk/working_vm/build/linux_x86_gcc_debug/deploy/jdk/jre/bin/default/libvmi.so:
	0xa5afd000:0xa5b02000
	0xa5b02000:0xa5b03000
/export/users/cc/cc-common/build/checkouts/hdk/working_vm/build/linux_x86_gcc_debug/deploy/jdk/jre/bin/libhynio.so:
	0xa5b03000:0xa5b05000
	0xa5b05000:0xa5b06000
/export/users/cc/cc-common/build/checkouts/hdk/working_vm/build/linux_x86_gcc_debug/deploy/jdk/jre/bin/libhyzlib.so:
	0xa5b06000:0xa5b18000
	0xa5b18000:0xa5b19000
/export/users/cc/cc-common/build/checkouts/hdk/working_vm/build/linux_x86_gcc_debug/deploy/jdk/jre/bin/default/libgc_gen_uncomp.so:
	0xb6027000:0xb60c3000
	0xb60c3000:0xb60c4000
/export/users/cc/cc-common/build/checkouts/hdk/working_vm/build/linux_x86_gcc_debug/deploy/jdk/jre/bin/default/libjitrino.so:
	0xb60c5000:0xb645c000
	0xb645c000:0xb646a000
/export/users/cc/cc-common/build/checkouts/hdk/working_vm/build/linux_x86_gcc_debug/deploy/jdk/jre/bin/default/libem.so:
	0xb64c5000:0xb64fe000
	0xb64fe000:0xb64ff000
/var/run/nscd/passwd:
	0xb657f000:0xb65b4000
/usr/lib/libstdc++.so.5.0.7:
	0xb66b6000:0xb676a000
	0xb676a000:0xb676f000
/export/users/cc/cc-common/build/checkouts/hdk/working_vm/build/linux_x86_gcc_debug/deploy/jdk/jre/bin/default/libicudata.so.34:
	0xb6774000:0xb6fe2000
	0xb6fe2000:0xb6fe3000
/usr/lib/libxml2.so.2.6.23:
	0xb6fe3000:0xb7109000
	0xb7109000:0xb7112000
/lib/libz.so.1.2.3:
	0xb7113000:0xb7124000
	0xb7124000:0xb7125000
/export/users/cc/cc-common/build/checkouts/hdk/working_vm/build/linux_x86_gcc_debug/deploy/jdk/jre/bin/default/libch.so:
	0xb7125000:0xb7132000
	0xb7132000:0xb7189000
/export/users/cc/cc-common/build/checkouts/hdk/working_vm/build/linux_x86_gcc_debug/deploy/jdk/jre/bin/default/libicuuc.so.34:
	0xb7391000:0xb7481000
	0xb7481000:0xb7488000
/export/users/cc/cc-common/build/checkouts/hdk/working_vm/build/linux_x86_gcc_debug/deploy/jdk/jre/bin/default/libharmonyvm.so:
	0xb7488000:0xb77cc000
	0xb77cc000:0xb7827000
/lib/libgcc_s.so.1:
	0xb7ab6000:0xb7ac0000
	0xb7ac0000:0xb7ac1000
/lib/libpthread-2.4.so:
	0xb7ac1000:0xb7ad1000
	0xb7ad1000:0xb7ad3000
/lib/librt-2.4.so:
	0xb7ad6000:0xb7add000
	0xb7add000:0xb7adf000
/usr/lib/libstdc++.so.6.0.8:
	0xb7adf000:0xb7bb4000
	0xb7bb4000:0xb7bb7000
	0xb7bb7000:0xb7bb9000
/lib/libdl-2.4.so:
	0xb7bbf000:0xb7bc1000
	0xb7bc1000:0xb7bc3000
/lib/libm-2.4.so:
	0xb7bc3000:0xb7be6000
	0xb7be6000:0xb7be8000
/lib/libc-2.4.so:
	0xb7be8000:0xb7d01000
	0xb7d01000:0xb7d03000
	0xb7d03000:0xb7d05000
/export/users/cc/cc-common/build/checkouts/hdk/working_vm/build/linux_x86_gcc_debug/deploy/jdk/jre/bin/libhyprt.so:
	0xb7d2c000:0xb7d47000
	0xb7d47000:0xb7d4b000
/export/users/cc/cc-common/build/checkouts/hdk/working_vm/build/linux_x86_gcc_debug/deploy/jdk/jre/bin/libhysig.so:
	0xb7d4e000:0xb7d50000
	0xb7d50000:0xb7d51000
/export/users/cc/cc-common/build/checkouts/hdk/working_vm/build/linux_x86_gcc_debug/deploy/jdk/jre/bin/default/libhythr.so:
	0xb7d51000:0xb7ed7000
	0xb7ed7000:0xb7ed8000
/lib/ld-2.4.so:
	0xb7f0b000:0xb7f25000
	0xb7f25000:0xb7f27000
[stack]:
	0xbf6e6000:0xbfed2000
[vdso]:
	0xffffe000:0xfffff000

Stack trace:
  0: port_set_longjump_regs (signals_ia32.cpp:38)
<end of stack trace>

Crashed module:
/export/users/cc/cc-common/build/checkouts/hdk/working_vm/build/linux_x86_gcc_debug/deploy/jdk/jre/bin/default/libch.so
(Unknown/system native module)

VM attached threads:

    [0xa54fbba0]  'ref handler'
    [0xa557cba0]  'finalizer'
    [0xa55fdba0]  'finalizer'
    [0xa567eba0]  'finalizer'
    [0xa56ffba0]  'finalizer'
    [0xa58deba0]  'profiler thread'
--->[0xb7ab5b80]  'main'
Test: Default mode since gc_cc is no moreClass: exception.FinalizeStackTest_gc_ccExit code: 139 Err: 
Signal reported: GENERAL_PROTECTION_FAULT
Registers:
    EAX: 0xbf759fec, EBX: 0xb71ce604, ECX: 0xbf758d0c, EDX: 0xb60d163f
    ESI: 0xa673eb6c, EDI: 0xbff46d41, ESP: 0xbf758bf4, EBP: 0xbf758c18
    EIP: 0xb71c5d3e

Command line:
/export/users/cc/cc-common/build/checkouts/hdk/working_vm/build/linux_x86_gcc_debug/deploy/jdk/jre/bin/java -XX:-vm.assert_dialog -Djava.library.path=/export/users/cc/cc-common/build/checkouts/hdk/working_vm/build/linux_x86_gcc_debug/tests/smoke.tests/natives/exception -classpath /export/users/cc/cc-common/build/checkouts/hdk/working_vm/build/linux_x86_gcc_debug/tests/smoke.tests/classes exception.FinalizeStackTest 

Working directory:
/export/users/cc/cc-common/build/checkouts/hdk/working_vm/build/linux_x86_gcc_debug/tests/smoke.tests

Environment variables:
JAVA_HOME=/export/users/cc/cc-common/build/checkouts/hdk/working_vm/build/linux_x86_gcc_debug/deploy/jdk/jre
LD_LIBRARY_PATH=/export/users/cc/cc-common/build/checkouts/hdk/working_vm/build/linux_x86_gcc_debug/deploy/jdk/jre/bin/default:/export/users/cc/cc-common/build/checkouts/hdk/working_vm/build/linux_x86_gcc_debug/deploy/jdk/jre/bin/:/export/users/cc/cc-common/build/checkouts/hdk/working_vm/build/linux_x86_gcc_debug/deploy/jdk/jre/bin:/export/users/cc/jdk1.5.0_06_Sun/jre/lib/i386/server:/export/users/cc/jdk1.5.0_06_Sun/jre/lib/i386:/export/users/cc/jdk1.5.0_06_Sun/jre/../lib/i386

Loaded modules:

/export/users/cc/cc-common/build/checkouts/hdk/working_vm/build/linux_x86_gcc_debug/deploy/jdk/jre/bin/java:
	0x08048000:0x0804e000
	0x0804e000:0x0804f000
[heap]:
	0x0804f000:0x086ba000
/export/users/cc/cc-common/build/checkouts/hdk/working_vm/build/linux_x86_gcc_debug/deploy/jdk/jre/bin/libhycharset.so:
	0xa59bb000:0xa5b0c000
	0xa5b0c000:0xa5b34000
/export/users/cc/cc-common/build/checkouts/hdk/working_vm/build/linux_x86_gcc_debug/deploy/jdk/jre/bin/libhyarchive.so:
	0xa5b34000:0xa5b40000
	0xa5b40000:0xa5b41000
/export/users/cc/cc-common/build/checkouts/hdk/working_vm/build/linux_x86_gcc_debug/deploy/jdk/jre/bin/libhyluni.so:
	0xa5b65000:0xa5b98000
	0xa5b98000:0xa5b99000
/export/users/cc/cc-common/build/checkouts/hdk/working_vm/build/linux_x86_gcc_debug/deploy/jdk/jre/bin/default/libvmi.so:
	0xa5b99000:0xa5b9e000
	0xa5b9e000:0xa5b9f000
/export/users/cc/cc-common/build/checkouts/hdk/working_vm/build/linux_x86_gcc_debug/deploy/jdk/jre/bin/libhynio.so:
	0xa5b9f000:0xa5ba1000
	0xa5ba1000:0xa5ba2000
/export/users/cc/cc-common/build/checkouts/hdk/working_vm/build/linux_x86_gcc_debug/deploy/jdk/jre/bin/libhyzlib.so:
	0xa5ba2000:0xa5bb4000
	0xa5bb4000:0xa5bb5000
/export/users/cc/cc-common/build/checkouts/hdk/working_vm/build/linux_x86_gcc_debug/deploy/jdk/jre/bin/default/libgc_gen_uncomp.so:
	0xb60c3000:0xb615f000
	0xb615f000:0xb6160000
/export/users/cc/cc-common/build/checkouts/hdk/working_vm/build/linux_x86_gcc_debug/deploy/jdk/jre/bin/default/libjitrino.so:
	0xb6161000:0xb64f8000
	0xb64f8000:0xb6506000
/export/users/cc/cc-common/build/checkouts/hdk/working_vm/build/linux_x86_gcc_debug/deploy/jdk/jre/bin/default/libem.so:
	0xb6561000:0xb659a000
	0xb659a000:0xb659b000
/var/run/nscd/passwd:
	0xb661b000:0xb6650000
/usr/lib/libstdc++.so.5.0.7:
	0xb6752000:0xb6806000
	0xb6806000:0xb680b000
/export/users/cc/cc-common/build/checkouts/hdk/working_vm/build/linux_x86_gcc_debug/deploy/jdk/jre/bin/default/libicudata.so.34:
	0xb6810000:0xb707e000
	0xb707e000:0xb707f000
/usr/lib/libxml2.so.2.6.23:
	0xb707f000:0xb71a5000
	0xb71a5000:0xb71ae000
/lib/libz.so.1.2.3:
	0xb71af000:0xb71c0000
	0xb71c0000:0xb71c1000
/export/users/cc/cc-common/build/checkouts/hdk/working_vm/build/linux_x86_gcc_debug/deploy/jdk/jre/bin/default/libch.so:
	0xb71c1000:0xb71ce000
	0xb71ce000:0xb7225000
/export/users/cc/cc-common/build/checkouts/hdk/working_vm/build/linux_x86_gcc_debug/deploy/jdk/jre/bin/default/libicuuc.so.34:
	0xb742d000:0xb751d000
	0xb751d000:0xb7524000
/export/users/cc/cc-common/build/checkouts/hdk/working_vm/build/linux_x86_gcc_debug/deploy/jdk/jre/bin/default/libharmonyvm.so:
	0xb7524000:0xb7868000
	0xb7868000:0xb78c3000
/lib/libgcc_s.so.1:
	0xb7b52000:0xb7b5c000
	0xb7b5c000:0xb7b5d000
/lib/libpthread-2.4.so:
	0xb7b5d000:0xb7b6d000
	0xb7b6d000:0xb7b6f000
/lib/librt-2.4.so:
	0xb7b72000:0xb7b79000
	0xb7b79000:0xb7b7b000
/usr/lib/libstdc++.so.6.0.8:
	0xb7b7b000:0xb7c50000
	0xb7c50000:0xb7c53000
	0xb7c53000:0xb7c55000
/lib/libdl-2.4.so:
	0xb7c5b000:0xb7c5d000
	0xb7c5d000:0xb7c5f000
/lib/libm-2.4.so:
	0xb7c5f000:0xb7c82000
	0xb7c82000:0xb7c84000
/lib/libc-2.4.so:
	0xb7c84000:0xb7d9d000
	0xb7d9d000:0xb7d9f000
	0xb7d9f000:0xb7da1000
/export/users/cc/cc-common/build/checkouts/hdk/working_vm/build/linux_x86_gcc_debug/deploy/jdk/jre/bin/libhyprt.so:
	0xb7dc8000:0xb7de3000
	0xb7de3000:0xb7de7000
/export/users/cc/cc-common/build/checkouts/hdk/working_vm/build/linux_x86_gcc_debug/deploy/jdk/jre/bin/libhysig.so:
	0xb7dea000:0xb7dec000
	0xb7dec000:0xb7ded000
/export/users/cc/cc-common/build/checkouts/hdk/working_vm/build/linux_x86_gcc_debug/deploy/jdk/jre/bin/default/libhythr.so:
	0xb7ded000:0xb7f73000
	0xb7f73000:0xb7f74000
/lib/ld-2.4.so:
	0xb7fa7000:0xb7fc1000
	0xb7fc1000:0xb7fc3000
[stack]:
	0xbf75a000:0xbff46000
[vdso]:
	0xffffe000:0xfffff000

Stack trace:
  0: port_set_longjump_regs (signals_ia32.cpp:38)
<end of stack trace>

Crashed module:
/export/users/cc/cc-common/build/checkouts/hdk/working_vm/build/linux_x86_gcc_debug/deploy/jdk/jre/bin/default/libch.so
(Unknown/system native module)

VM attached threads:

    [0xa557cba0]  'ref handler'
    [0xa55fdba0]  'finalizer'
    [0xa567eba0]  'finalizer'
    [0xa56ffba0]  'finalizer'
    [0xa58f9ba0]  'finalizer'
    [0xa597aba0]  'profiler thread'
--->[0xb7b51b80]  'main'
Test: jitrino.JETClass: exception.FinalizeStackTest_jetExit code: 139 Err: 
Signal reported: GENERAL_PROTECTION_FAULT
Registers:
    EAX: 0xbf219ff8, EBX: 0xb717d604, ECX: 0xbf218d0c, EDX: 0xb7f6626f
    ESI: 0xa66edb6c, EDI: 0xbfa06d41, ESP: 0xbf218bf4, EBP: 0xbf218c18
    EIP: 0xb7174d3e

Command line:
/export/users/cc/cc-common/build/checkouts/hdk/working_vm/build/linux_x86_gcc_debug/deploy/jdk/jre/bin/java -Xem:jet -XX:-vm.assert_dialog -Djava.library.path=/export/users/cc/cc-common/build/checkouts/hdk/working_vm/build/linux_x86_gcc_debug/tests/smoke.tests/natives/exception -classpath /export/users/cc/cc-common/build/checkouts/hdk/working_vm/build/linux_x86_gcc_debug/tests/smoke.tests/classes exception.FinalizeStackTest 

Working directory:
/export/users/cc/cc-common/build/checkouts/hdk/working_vm/build/linux_x86_gcc_debug/tests/smoke.tests

Environment variables:
JAVA_HOME=/export/users/cc/cc-common/build/checkouts/hdk/working_vm/build/linux_x86_gcc_debug/deploy/jdk/jre
LD_LIBRARY_PATH=/export/users/cc/cc-common/build/checkouts/hdk/working_vm/build/linux_x86_gcc_debug/deploy/jdk/jre/bin/default:/export/users/cc/cc-common/build/checkouts/hdk/working_vm/build/linux_x86_gcc_debug/deploy/jdk/jre/bin/:/export/users/cc/cc-common/build/checkouts/hdk/working_vm/build/linux_x86_gcc_debug/deploy/jdk/jre/bin:/export/users/cc/jdk1.5.0_06_Sun/jre/lib/i386/server:/export/users/cc/jdk1.5.0_06_Sun/jre/lib/i386:/export/users/cc/jdk1.5.0_06_Sun/jre/../lib/i386

Loaded modules:

/export/users/cc/cc-common/build/checkouts/hdk/working_vm/build/linux_x86_gcc_debug/deploy/jdk/jre/bin/java:
	0x08048000:0x0804e000
	0x0804e000:0x0804f000
[heap]:
	0x0804f000:0x08754000
/export/users/cc/cc-common/build/checkouts/hdk/working_vm/build/linux_x86_gcc_debug/deploy/jdk/jre/bin/libhycharset.so:
	0xa596a000:0xa5abb000
	0xa5abb000:0xa5ae3000
/export/users/cc/cc-common/build/checkouts/hdk/working_vm/build/linux_x86_gcc_debug/deploy/jdk/jre/bin/libhyarchive.so:
	0xa5ae3000:0xa5aef000
	0xa5aef000:0xa5af0000
/export/users/cc/cc-common/build/checkouts/hdk/working_vm/build/linux_x86_gcc_debug/deploy/jdk/jre/bin/libhyluni.so:
	0xa5b14000:0xa5b47000
	0xa5b47000:0xa5b48000
/export/users/cc/cc-common/build/checkouts/hdk/working_vm/build/linux_x86_gcc_debug/deploy/jdk/jre/bin/default/libvmi.so:
	0xa5b48000:0xa5b4d000
	0xa5b4d000:0xa5b4e000
/export/users/cc/cc-common/build/checkouts/hdk/working_vm/build/linux_x86_gcc_debug/deploy/jdk/jre/bin/libhynio.so:
	0xa5b4e000:0xa5b50000
	0xa5b50000:0xa5b51000
/export/users/cc/cc-common/build/checkouts/hdk/working_vm/build/linux_x86_gcc_debug/deploy/jdk/jre/bin/libhyzlib.so:
	0xa5b51000:0xa5b63000
	0xa5b63000:0xa5b64000
/export/users/cc/cc-common/build/checkouts/hdk/working_vm/build/linux_x86_gcc_debug/deploy/jdk/jre/bin/default/libgc_gen_uncomp.so:
	0xb6072000:0xb610e000
	0xb610e000:0xb610f000
/export/users/cc/cc-common/build/checkouts/hdk/working_vm/build/linux_x86_gcc_debug/deploy/jdk/jre/bin/default/libjitrino.so:
	0xb6110000:0xb64a7000
	0xb64a7000:0xb64b5000
/export/users/cc/cc-common/build/checkouts/hdk/working_vm/build/linux_x86_gcc_debug/deploy/jdk/jre/bin/default/libem.so:
	0xb6510000:0xb6549000
	0xb6549000:0xb654a000
/var/run/nscd/passwd:
	0xb65ca000:0xb65ff000
/usr/lib/libstdc++.so.5.0.7:
	0xb6701000:0xb67b5000
	0xb67b5000:0xb67ba000
/export/users/cc/cc-common/build/checkouts/hdk/working_vm/build/linux_x86_gcc_debug/deploy/jdk/jre/bin/default/libicudata.so.34:
	0xb67bf000:0xb702d000
	0xb702d000:0xb702e000
/usr/lib/libxml2.so.2.6.23:
	0xb702e000:0xb7154000
	0xb7154000:0xb715d000
/lib/libz.so.1.2.3:
	0xb715e000:0xb716f000
	0xb716f000:0xb7170000
/export/users/cc/cc-common/build/checkouts/hdk/working_vm/build/linux_x86_gcc_debug/deploy/jdk/jre/bin/default/libch.so:
	0xb7170000:0xb717d000
	0xb717d000:0xb71d4000
/export/users/cc/cc-common/build/checkouts/hdk/working_vm/build/linux_x86_gcc_debug/deploy/jdk/jre/bin/default/libicuuc.so.34:
	0xb73dc000:0xb74cc000
	0xb74cc000:0xb74d3000
/export/users/cc/cc-common/build/checkouts/hdk/working_vm/build/linux_x86_gcc_debug/deploy/jdk/jre/bin/default/libharmonyvm.so:
	0xb74d3000:0xb7817000
	0xb7817000:0xb7872000
/lib/libgcc_s.so.1:
	0xb7b01000:0xb7b0b000
	0xb7b0b000:0xb7b0c000
/lib/libpthread-2.4.so:
	0xb7b0c000:0xb7b1c000
	0xb7b1c000:0xb7b1e000
/lib/librt-2.4.so:
	0xb7b21000:0xb7b28000
	0xb7b28000:0xb7b2a000
/usr/lib/libstdc++.so.6.0.8:
	0xb7b2a000:0xb7bff000
	0xb7bff000:0xb7c02000
	0xb7c02000:0xb7c04000
/lib/libdl-2.4.so:
	0xb7c0a000:0xb7c0c000
	0xb7c0c000:0xb7c0e000
/lib/libm-2.4.so:
	0xb7c0e000:0xb7c31000
	0xb7c31000:0xb7c33000
/lib/libc-2.4.so:
	0xb7c33000:0xb7d4c000
	0xb7d4c000:0xb7d4e000
	0xb7d4e000:0xb7d50000
/export/users/cc/cc-common/build/checkouts/hdk/working_vm/build/linux_x86_gcc_debug/deploy/jdk/jre/bin/libhyprt.so:
	0xb7d77000:0xb7d92000
	0xb7d92000:0xb7d96000
/export/users/cc/cc-common/build/checkouts/hdk/working_vm/build/linux_x86_gcc_debug/deploy/jdk/jre/bin/libhysig.so:
	0xb7d99000:0xb7d9b000
	0xb7d9b000:0xb7d9c000
/export/users/cc/cc-common/build/checkouts/hdk/working_vm/build/linux_x86_gcc_debug/deploy/jdk/jre/bin/default/libhythr.so:
	0xb7d9c000:0xb7f22000
	0xb7f22000:0xb7f23000
/lib/ld-2.4.so:
	0xb7f56000:0xb7f70000
	0xb7f70000:0xb7f72000
[stack]:
	0xbf21a000:0xbfa06000
[vdso]:
	0xffffe000:0xfffff000

Stack trace:
  0: port_set_longjump_regs (signals_ia32.cpp:38)
<end of stack trace>

Crashed module:
/export/users/cc/cc-common/build/checkouts/hdk/working_vm/build/linux_x86_gcc_debug/deploy/jdk/jre/bin/default/libch.so
(Unknown/system native module)

VM attached threads:

    [0xa5725ba0]  'ref handler'
    [0xa57a6ba0]  'finalizer'
    [0xa5827ba0]  'finalizer'
    [0xa58a8ba0]  'finalizer'
    [0xa5929ba0]  'finalizer'
--->[0xb7b00b80]  'main'
Test: Client mode JIT (default)Class: exception.FinalizeStackTest_jitExit code: 139 Err: 
Signal reported: GENERAL_PROTECTION_FAULT
Registers:
    EAX: 0xbf02bfac, EBX: 0xb7112604, ECX: 0xbf02ad0c, EDX: 0xb601563f
    ESI: 0xa667eb74, EDI: 0xbf819d41, ESP: 0xbf02abf4, EBP: 0xbf02ac18
    EIP: 0xb7109d3e

Command line:
/export/users/cc/cc-common/build/checkouts/hdk/working_vm/build/linux_x86_gcc_debug/deploy/jdk/jre/bin/java -XX:-vm.assert_dialog -Djava.library.path=/export/users/cc/cc-common/build/checkouts/hdk/working_vm/build/linux_x86_gcc_debug/tests/smoke.tests/natives/exception -classpath /export/users/cc/cc-common/build/checkouts/hdk/working_vm/build/linux_x86_gcc_debug/tests/smoke.tests/classes exception.FinalizeStackTest 

Working directory:
/export/users/cc/cc-common/build/checkouts/hdk/working_vm/build/linux_x86_gcc_debug/tests/smoke.tests

Environment variables:
JAVA_HOME=/export/users/cc/cc-common/build/checkouts/hdk/working_vm/build/linux_x86_gcc_debug/deploy/jdk/jre
LD_LIBRARY_PATH=/export/users/cc/cc-common/build/checkouts/hdk/working_vm/build/linux_x86_gcc_debug/deploy/jdk/jre/bin/default:/export/users/cc/cc-common/build/checkouts/hdk/working_vm/build/linux_x86_gcc_debug/deploy/jdk/jre/bin/:/export/users/cc/cc-common/build/checkouts/hdk/working_vm/build/linux_x86_gcc_debug/deploy/jdk/jre/bin:/export/users/cc/jdk1.5.0_06_Sun/jre/lib/i386/server:/export/users/cc/jdk1.5.0_06_Sun/jre/lib/i386:/export/users/cc/jdk1.5.0_06_Sun/jre/../lib/i386

Loaded modules:

/export/users/cc/cc-common/build/checkouts/hdk/working_vm/build/linux_x86_gcc_debug/deploy/jdk/jre/bin/java:
	0x08048000:0x0804e000
	0x0804e000:0x0804f000
[heap]:
	0x0804f000:0x08780000
/export/users/cc/cc-common/build/checkouts/hdk/working_vm/build/linux_x86_gcc_debug/deploy/jdk/jre/bin/libhycharset.so:
	0xa58ff000:0xa5a50000
	0xa5a50000:0xa5a78000
/export/users/cc/cc-common/build/checkouts/hdk/working_vm/build/linux_x86_gcc_debug/deploy/jdk/jre/bin/libhyarchive.so:
	0xa5a78000:0xa5a84000
	0xa5a84000:0xa5a85000
/export/users/cc/cc-common/build/checkouts/hdk/working_vm/build/linux_x86_gcc_debug/deploy/jdk/jre/bin/libhyluni.so:
	0xa5aa9000:0xa5adc000
	0xa5adc000:0xa5add000
/export/users/cc/cc-common/build/checkouts/hdk/working_vm/build/linux_x86_gcc_debug/deploy/jdk/jre/bin/default/libvmi.so:
	0xa5add000:0xa5ae2000
	0xa5ae2000:0xa5ae3000
/export/users/cc/cc-common/build/checkouts/hdk/working_vm/build/linux_x86_gcc_debug/deploy/jdk/jre/bin/libhynio.so:
	0xa5ae3000:0xa5ae5000
	0xa5ae5000:0xa5ae6000
/export/users/cc/cc-common/build/checkouts/hdk/working_vm/build/linux_x86_gcc_debug/deploy/jdk/jre/bin/libhyzlib.so:
	0xa5ae6000:0xa5af8000
	0xa5af8000:0xa5af9000
/export/users/cc/cc-common/build/checkouts/hdk/working_vm/build/linux_x86_gcc_debug/deploy/jdk/jre/bin/default/libgc_gen_uncomp.so:
	0xb6007000:0xb60a3000
	0xb60a3000:0xb60a4000
/export/users/cc/cc-common/build/checkouts/hdk/working_vm/build/linux_x86_gcc_debug/deploy/jdk/jre/bin/default/libjitrino.so:
	0xb60a5000:0xb643c000
	0xb643c000:0xb644a000
/export/users/cc/cc-common/build/checkouts/hdk/working_vm/build/linux_x86_gcc_debug/deploy/jdk/jre/bin/default/libem.so:
	0xb64a5000:0xb64de000
	0xb64de000:0xb64df000
/var/run/nscd/passwd:
	0xb655f000:0xb6594000
/usr/lib/libstdc++.so.5.0.7:
	0xb6696000:0xb674a000
	0xb674a000:0xb674f000
/export/users/cc/cc-common/build/checkouts/hdk/working_vm/build/linux_x86_gcc_debug/deploy/jdk/jre/bin/default/libicudata.so.34:
	0xb6754000:0xb6fc2000
	0xb6fc2000:0xb6fc3000
/usr/lib/libxml2.so.2.6.23:
	0xb6fc3000:0xb70e9000
	0xb70e9000:0xb70f2000
/lib/libz.so.1.2.3:
	0xb70f3000:0xb7104000
	0xb7104000:0xb7105000
/export/users/cc/cc-common/build/checkouts/hdk/working_vm/build/linux_x86_gcc_debug/deploy/jdk/jre/bin/default/libch.so:
	0xb7105000:0xb7112000
	0xb7112000:0xb7169000
/export/users/cc/cc-common/build/checkouts/hdk/working_vm/build/linux_x86_gcc_debug/deploy/jdk/jre/bin/default/libicuuc.so.34:
	0xb7371000:0xb7461000
	0xb7461000:0xb7468000
/export/users/cc/cc-common/build/checkouts/hdk/working_vm/build/linux_x86_gcc_debug/deploy/jdk/jre/bin/default/libharmonyvm.so:
	0xb7468000:0xb77ac000
	0xb77ac000:0xb7807000
/lib/libgcc_s.so.1:
	0xb7a96000:0xb7aa0000
	0xb7aa0000:0xb7aa1000
/lib/libpthread-2.4.so:
	0xb7aa1000:0xb7ab1000
	0xb7ab1000:0xb7ab3000
/lib/librt-2.4.so:
	0xb7ab6000:0xb7abd000
	0xb7abd000:0xb7abf000
/usr/lib/libstdc++.so.6.0.8:
	0xb7abf000:0xb7b94000
	0xb7b94000:0xb7b97000
	0xb7b97000:0xb7b99000
/lib/libdl-2.4.so:
	0xb7b9f000:0xb7ba1000
	0xb7ba1000:0xb7ba3000
/lib/libm-2.4.so:
	0xb7ba3000:0xb7bc6000
	0xb7bc6000:0xb7bc8000
/lib/libc-2.4.so:
	0xb7bc8000:0xb7ce1000
	0xb7ce1000:0xb7ce3000
	0xb7ce3000:0xb7ce5000
/export/users/cc/cc-common/build/checkouts/hdk/working_vm/build/linux_x86_gcc_debug/deploy/jdk/jre/bin/libhyprt.so:
	0xb7d0c000:0xb7d27000
	0xb7d27000:0xb7d2b000
/export/users/cc/cc-common/build/checkouts/hdk/working_vm/build/linux_x86_gcc_debug/deploy/jdk/jre/bin/libhysig.so:
	0xb7d2e000:0xb7d30000
	0xb7d30000:0xb7d31000
/export/users/cc/cc-common/build/checkouts/hdk/working_vm/build/linux_x86_gcc_debug/deploy/jdk/jre/bin/default/libhythr.so:
	0xb7d31000:0xb7eb7000
	0xb7eb7000:0xb7eb8000
/lib/ld-2.4.so:
	0xb7eeb000:0xb7f05000
	0xb7f05000:0xb7f07000
[stack]:
	0xbf02c000:0xbf818000
[vdso]:
	0xffffe000:0xfffff000

Stack trace:
  0: port_set_longjump_regs (signals_ia32.cpp:38)
<end of stack trace>

Crashed module:
/export/users/cc/cc-common/build/checkouts/hdk/working_vm/build/linux_x86_gcc_debug/deploy/jdk/jre/bin/default/libch.so
(Unknown/system native module)

VM attached threads:

    [0xa54fbba0]  'ref handler'
    [0xa557cba0]  'finalizer'
    [0xa55fdba0]  'finalizer'
    [0xa567eba0]  'finalizer'
    [0xa56ffba0]  'finalizer'
    [0xa58beba0]  'profiler thread'
--->[0xb7a95b80]  'main'
Test: jitrino.OPTClass: exception.FinalizeStackTest_optExit code: 139 Err: 
Signal reported: GENERAL_PROTECTION_FAULT
Registers:
    EAX: 0xbf4e8fdc, EBX: 0xb71f2604, ECX: 0xbf4e7d0c, EDX: 0xb60f563f
    ESI: 0xbfcd3ea0, EDI: 0xbfcd5d41, ESP: 0xbf4e7bf4, EBP: 0xbf4e7c18
    EIP: 0xb71e9d3e

Command line:
/export/users/cc/cc-common/build/checkouts/hdk/working_vm/build/linux_x86_gcc_debug/deploy/jdk/jre/bin/java -Xem:opt -XX:-vm.assert_dialog -Djava.library.path=/export/users/cc/cc-common/build/checkouts/hdk/working_vm/build/linux_x86_gcc_debug/tests/smoke.tests/natives/exception -classpath /export/users/cc/cc-common/build/checkouts/hdk/working_vm/build/linux_x86_gcc_debug/tests/smoke.tests/classes exception.FinalizeStackTest 

Working directory:
/export/users/cc/cc-common/build/checkouts/hdk/working_vm/build/linux_x86_gcc_debug/tests/smoke.tests

Environment variables:
JAVA_HOME=/export/users/cc/cc-common/build/checkouts/hdk/working_vm/build/linux_x86_gcc_debug/deploy/jdk/jre
LD_LIBRARY_PATH=/export/users/cc/cc-common/build/checkouts/hdk/working_vm/build/linux_x86_gcc_debug/deploy/jdk/jre/bin/default:/export/users/cc/cc-common/build/checkouts/hdk/working_vm/build/linux_x86_gcc_debug/deploy/jdk/jre/bin/:/export/users/cc/cc-common/build/checkouts/hdk/working_vm/build/linux_x86_gcc_debug/deploy/jdk/jre/bin:/export/users/cc/jdk1.5.0_06_Sun/jre/lib/i386/server:/export/users/cc/jdk1.5.0_06_Sun/jre/lib/i386:/export/users/cc/jdk1.5.0_06_Sun/jre/../lib/i386

Loaded modules:

/export/users/cc/cc-common/build/checkouts/hdk/working_vm/build/linux_x86_gcc_debug/deploy/jdk/jre/bin/java:
	0x08048000:0x0804e000
	0x0804e000:0x0804f000
[heap]:
	0x0804f000:0x08965000
/export/users/cc/cc-common/build/checkouts/hdk/working_vm/build/linux_x86_gcc_debug/deploy/jdk/jre/bin/libhycharset.so:
	0xa59df000:0xa5b30000
	0xa5b30000:0xa5b58000
/export/users/cc/cc-common/build/checkouts/hdk/working_vm/build/linux_x86_gcc_debug/deploy/jdk/jre/bin/libhyarchive.so:
	0xa5b58000:0xa5b64000
	0xa5b64000:0xa5b65000
/export/users/cc/cc-common/build/checkouts/hdk/working_vm/build/linux_x86_gcc_debug/deploy/jdk/jre/bin/libhyluni.so:
	0xa5b89000:0xa5bbc000
	0xa5bbc000:0xa5bbd000
/export/users/cc/cc-common/build/checkouts/hdk/working_vm/build/linux_x86_gcc_debug/deploy/jdk/jre/bin/default/libvmi.so:
	0xa5bbd000:0xa5bc2000
	0xa5bc2000:0xa5bc3000
/export/users/cc/cc-common/build/checkouts/hdk/working_vm/build/linux_x86_gcc_debug/deploy/jdk/jre/bin/libhynio.so:
	0xa5bc3000:0xa5bc5000
	0xa5bc5000:0xa5bc6000
/export/users/cc/cc-common/build/checkouts/hdk/working_vm/build/linux_x86_gcc_debug/deploy/jdk/jre/bin/libhyzlib.so:
	0xa5bc6000:0xa5bd8000
	0xa5bd8000:0xa5bd9000
/export/users/cc/cc-common/build/checkouts/hdk/working_vm/build/linux_x86_gcc_debug/deploy/jdk/jre/bin/default/libgc_gen_uncomp.so:
	0xb60e7000:0xb6183000
	0xb6183000:0xb6184000
/export/users/cc/cc-common/build/checkouts/hdk/working_vm/build/linux_x86_gcc_debug/deploy/jdk/jre/bin/default/libjitrino.so:
	0xb6185000:0xb651c000
	0xb651c000:0xb652a000
/export/users/cc/cc-common/build/checkouts/hdk/working_vm/build/linux_x86_gcc_debug/deploy/jdk/jre/bin/default/libem.so:
	0xb6585000:0xb65be000
	0xb65be000:0xb65bf000
/var/run/nscd/passwd:
	0xb663f000:0xb6674000
/usr/lib/libstdc++.so.5.0.7:
	0xb6776000:0xb682a000
	0xb682a000:0xb682f000
/export/users/cc/cc-common/build/checkouts/hdk/working_vm/build/linux_x86_gcc_debug/deploy/jdk/jre/bin/default/libicudata.so.34:
	0xb6834000:0xb70a2000
	0xb70a2000:0xb70a3000
/usr/lib/libxml2.so.2.6.23:
	0xb70a3000:0xb71c9000
	0xb71c9000:0xb71d2000
/lib/libz.so.1.2.3:
	0xb71d3000:0xb71e4000
	0xb71e4000:0xb71e5000
/export/users/cc/cc-common/build/checkouts/hdk/working_vm/build/linux_x86_gcc_debug/deploy/jdk/jre/bin/default/libch.so:
	0xb71e5000:0xb71f2000
	0xb71f2000:0xb7249000
/export/users/cc/cc-common/build/checkouts/hdk/working_vm/build/linux_x86_gcc_debug/deploy/jdk/jre/bin/default/libicuuc.so.34:
	0xb7451000:0xb7541000
	0xb7541000:0xb7548000
/export/users/cc/cc-common/build/checkouts/hdk/working_vm/build/linux_x86_gcc_debug/deploy/jdk/jre/bin/default/libharmonyvm.so:
	0xb7548000:0xb788c000
	0xb788c000:0xb78e7000
/lib/libgcc_s.so.1:
	0xb7b76000:0xb7b80000
	0xb7b80000:0xb7b81000
/lib/libpthread-2.4.so:
	0xb7b81000:0xb7b91000
	0xb7b91000:0xb7b93000
/lib/librt-2.4.so:
	0xb7b96000:0xb7b9d000
	0xb7b9d000:0xb7b9f000
/usr/lib/libstdc++.so.6.0.8:
	0xb7b9f000:0xb7c74000
	0xb7c74000:0xb7c77000
	0xb7c77000:0xb7c79000
/lib/libdl-2.4.so:
	0xb7c7f000:0xb7c81000
	0xb7c81000:0xb7c83000
/lib/libm-2.4.so:
	0xb7c83000:0xb7ca6000
	0xb7ca6000:0xb7ca8000
/lib/libc-2.4.so:
	0xb7ca8000:0xb7dc1000
	0xb7dc1000:0xb7dc3000
	0xb7dc3000:0xb7dc5000
/export/users/cc/cc-common/build/checkouts/hdk/working_vm/build/linux_x86_gcc_debug/deploy/jdk/jre/bin/libhyprt.so:
	0xb7dec000:0xb7e07000
	0xb7e07000:0xb7e0b000
/export/users/cc/cc-common/build/checkouts/hdk/working_vm/build/linux_x86_gcc_debug/deploy/jdk/jre/bin/libhysig.so:
	0xb7e0e000:0xb7e10000
	0xb7e10000:0xb7e11000
/export/users/cc/cc-common/build/checkouts/hdk/working_vm/build/linux_x86_gcc_debug/deploy/jdk/jre/bin/default/libhythr.so:
	0xb7e11000:0xb7f97000
	0xb7f97000:0xb7f98000
/lib/ld-2.4.so:
	0xb7fcb000:0xb7fe5000
	0xb7fe5000:0xb7fe7000
[stack]:
	0xbf4e9000:0xbfcd5000
[vdso]:
	0xffffe000:0xfffff000

Stack trace:
  0: port_set_longjump_regs (signals_ia32.cpp:38)
<end of stack trace>

Crashed module:
/export/users/cc/cc-common/build/checkouts/hdk/working_vm/build/linux_x86_gcc_debug/deploy/jdk/jre/bin/default/libch.so
(Unknown/system native module)

VM attached threads:

    [0xa579aba0]  'ref handler'
    [0xa581bba0]  'finalizer'
    [0xa589cba0]  'finalizer'
    [0xa591dba0]  'finalizer'
    [0xa599eba0]  'finalizer'
--->[0xb7b75b80]  'main'
Test: Server mode JITClass: exception.FinalizeStackTest_srvExit code: 139 Err: 
Signal reported: GENERAL_PROTECTION_FAULT
Registers:
    EAX: 0xbf24effc, EBX: 0xb71ae604, ECX: 0xbf24dd0c, EDX: 0xb60b163f
    ESI: 0xbfa39c10, EDI: 0x087f2b1c, ESP: 0xbf24dbf4, EBP: 0xbf24dc18
    EIP: 0xb71a5d3e

Command line:
/export/users/cc/cc-common/build/checkouts/hdk/working_vm/build/linux_x86_gcc_debug/deploy/jdk/jre/bin/java -server -XX:-vm.assert_dialog -Djava.library.path=/export/users/cc/cc-common/build/checkouts/hdk/working_vm/build/linux_x86_gcc_debug/tests/smoke.tests/natives/exception -classpath /export/users/cc/cc-common/build/checkouts/hdk/working_vm/build/linux_x86_gcc_debug/tests/smoke.tests/classes exception.FinalizeStackTest 

Working directory:
/export/users/cc/cc-common/build/checkouts/hdk/working_vm/build/linux_x86_gcc_debug/tests/smoke.tests

Environment variables:
JAVA_HOME=/export/users/cc/cc-common/build/checkouts/hdk/working_vm/build/linux_x86_gcc_debug/deploy/jdk/jre
LD_LIBRARY_PATH=/export/users/cc/cc-common/build/checkouts/hdk/working_vm/build/linux_x86_gcc_debug/deploy/jdk/jre/bin/default:/export/users/cc/cc-common/build/checkouts/hdk/working_vm/build/linux_x86_gcc_debug/deploy/jdk/jre/bin/:/export/users/cc/cc-common/build/checkouts/hdk/working_vm/build/linux_x86_gcc_debug/deploy/jdk/jre/bin:/export/users/cc/jdk1.5.0_06_Sun/jre/lib/i386/server:/export/users/cc/jdk1.5.0_06_Sun/jre/lib/i386:/export/users/cc/jdk1.5.0_06_Sun/jre/../lib/i386

Loaded modules:

/export/users/cc/cc-common/build/checkouts/hdk/working_vm/build/linux_x86_gcc_debug/deploy/jdk/jre/bin/java:
	0x08048000:0x0804e000
	0x0804e000:0x0804f000
[heap]:
	0x0804f000:0x088db000
/export/users/cc/cc-common/build/checkouts/hdk/working_vm/build/linux_x86_gcc_debug/deploy/jdk/jre/bin/libhycharset.so:
	0xa599b000:0xa5aec000
	0xa5aec000:0xa5b14000
/export/users/cc/cc-common/build/checkouts/hdk/working_vm/build/linux_x86_gcc_debug/deploy/jdk/jre/bin/libhyarchive.so:
	0xa5b14000:0xa5b20000
	0xa5b20000:0xa5b21000
/export/users/cc/cc-common/build/checkouts/hdk/working_vm/build/linux_x86_gcc_debug/deploy/jdk/jre/bin/libhyluni.so:
	0xa5b45000:0xa5b78000
	0xa5b78000:0xa5b79000
/export/users/cc/cc-common/build/checkouts/hdk/working_vm/build/linux_x86_gcc_debug/deploy/jdk/jre/bin/default/libvmi.so:
	0xa5b79000:0xa5b7e000
	0xa5b7e000:0xa5b7f000
/export/users/cc/cc-common/build/checkouts/hdk/working_vm/build/linux_x86_gcc_debug/deploy/jdk/jre/bin/libhynio.so:
	0xa5b7f000:0xa5b81000
	0xa5b81000:0xa5b82000
/export/users/cc/cc-common/build/checkouts/hdk/working_vm/build/linux_x86_gcc_debug/deploy/jdk/jre/bin/libhyzlib.so:
	0xa5b82000:0xa5b94000
	0xa5b94000:0xa5b95000
/export/users/cc/cc-common/build/checkouts/hdk/working_vm/build/linux_x86_gcc_debug/deploy/jdk/jre/bin/default/libgc_gen_uncomp.so:
	0xb60a3000:0xb613f000
	0xb613f000:0xb6140000
/export/users/cc/cc-common/build/checkouts/hdk/working_vm/build/linux_x86_gcc_debug/deploy/jdk/jre/bin/default/libjitrino.so:
	0xb6141000:0xb64d8000
	0xb64d8000:0xb64e6000
/export/users/cc/cc-common/build/checkouts/hdk/working_vm/build/linux_x86_gcc_debug/deploy/jdk/jre/bin/default/libem.so:
	0xb6541000:0xb657a000
	0xb657a000:0xb657b000
/var/run/nscd/passwd:
	0xb65fb000:0xb6630000
/usr/lib/libstdc++.so.5.0.7:
	0xb6732000:0xb67e6000
	0xb67e6000:0xb67eb000
/export/users/cc/cc-common/build/checkouts/hdk/working_vm/build/linux_x86_gcc_debug/deploy/jdk/jre/bin/default/libicudata.so.34:
	0xb67f0000:0xb705e000
	0xb705e000:0xb705f000
/usr/lib/libxml2.so.2.6.23:
	0xb705f000:0xb7185000
	0xb7185000:0xb718e000
/lib/libz.so.1.2.3:
	0xb718f000:0xb71a0000
	0xb71a0000:0xb71a1000
/export/users/cc/cc-common/build/checkouts/hdk/working_vm/build/linux_x86_gcc_debug/deploy/jdk/jre/bin/default/libch.so:
	0xb71a1000:0xb71ae000
	0xb71ae000:0xb7205000
/export/users/cc/cc-common/build/checkouts/hdk/working_vm/build/linux_x86_gcc_debug/deploy/jdk/jre/bin/default/libicuuc.so.34:
	0xb740d000:0xb74fd000
	0xb74fd000:0xb7504000
/export/users/cc/cc-common/build/checkouts/hdk/working_vm/build/linux_x86_gcc_debug/deploy/jdk/jre/bin/default/libharmonyvm.so:
	0xb7504000:0xb7848000
	0xb7848000:0xb78a3000
/lib/libgcc_s.so.1:
	0xb7b32000:0xb7b3c000
	0xb7b3c000:0xb7b3d000
/lib/libpthread-2.4.so:
	0xb7b3d000:0xb7b4d000
	0xb7b4d000:0xb7b4f000
/lib/librt-2.4.so:
	0xb7b52000:0xb7b59000
	0xb7b59000:0xb7b5b000
/usr/lib/libstdc++.so.6.0.8:
	0xb7b5b000:0xb7c30000
	0xb7c30000:0xb7c33000
	0xb7c33000:0xb7c35000
/lib/libdl-2.4.so:
	0xb7c3b000:0xb7c3d000
	0xb7c3d000:0xb7c3f000
/lib/libm-2.4.so:
	0xb7c3f000:0xb7c62000
	0xb7c62000:0xb7c64000
/lib/libc-2.4.so:
	0xb7c64000:0xb7d7d000
	0xb7d7d000:0xb7d7f000
	0xb7d7f000:0xb7d81000
/export/users/cc/cc-common/build/checkouts/hdk/working_vm/build/linux_x86_gcc_debug/deploy/jdk/jre/bin/libhyprt.so:
	0xb7da8000:0xb7dc3000
	0xb7dc3000:0xb7dc7000
/export/users/cc/cc-common/build/checkouts/hdk/working_vm/build/linux_x86_gcc_debug/deploy/jdk/jre/bin/libhysig.so:
	0xb7dca000:0xb7dcc000
	0xb7dcc000:0xb7dcd000
/export/users/cc/cc-common/build/checkouts/hdk/working_vm/build/linux_x86_gcc_debug/deploy/jdk/jre/bin/default/libhythr.so:
	0xb7dcd000:0xb7f53000
	0xb7f53000:0xb7f54000
/lib/ld-2.4.so:
	0xb7f87000:0xb7fa1000
	0xb7fa1000:0xb7fa3000
[stack]:
	0xbf24f000:0xbfa3b000
[vdso]:
	0xffffe000:0xfffff000

Stack trace:
  0: port_set_longjump_regs (signals_ia32.cpp:38)
<end of stack trace>

Crashed module:
/export/users/cc/cc-common/build/checkouts/hdk/working_vm/build/linux_x86_gcc_debug/deploy/jdk/jre/bin/default/libch.so
(Unknown/system native module)

VM attached threads:

    [0xa557cba0]  'ref handler'
    [0xa55fdba0]  'finalizer'
    [0xa567eba0]  'finalizer'
    [0xa56ffba0]  'finalizer'
    [0xa58d9ba0]  'finalizer'
    [0xa595aba0]  'profiler thread'
--->[0xb7b31b80]  'main'

***********************************************************
Modifications since last successful build:	(2)
            
add cc-hdk log20080320233617Lbuild.741 03/20/2008 23:36:17hdk
add cc-hdk log20080320233617Lbuild.741 03/20/2008 23:36:17hdk

begin 644 execution_log.zip
M4$L#! H    ( -0<=3CS5_TS@B$  ,:# @ 2    97AE8W5T:6]N7VQO9RYH
M=&UL[5U[<]M&DO_?GV*N<E?KI$*0X%/49E/E6'(BKQ7I+*UWKUPN%0@.14@@
MP,)#-O/IKP<@*3[PZ"8Y(F6U*Z60TO1T3T]/3T_/#XU?AM'(_?67GM^?_/K+
M.)"__F*),)JX\A]_&_A>5 F=O^2Q.*K]S]__]NNK>-RW(ED)'[SC5Z\JZ3?X
M%,3P70CQN2]=&<DOXD3]W_%N1;?9$@/'E:$8!/Y(5.6WL1]$U3B405BU;?BO
M8ONCD>]5>['C]JN!#&,W"JO]P'T852(91JI?Z/G.>K"^B-]4(]7?L4C:&]]&
M[E*#I2\@9F4<^./C_"8I'VD/_>5&Z6?U>QC,QP^?SE-^XJWO#9S;.+ BQ_?R
M29)_?_AAHH/W\&?Q#V$:+:-V4VN+UU>Q)\X=._##21C)42C./-OXL;BSQW]^
M")VYCA=_PU%8@3T$BF]'[8+VPXEAC\<&S,48M!M ^UO;1DID#VZA?5_VXMMB
M"I@/$<@')P3= 46[T6T<F:5,0#3/-T)',1E8;B@+*:"UZ]N6:_SE.KURBM3X
M0*K0CP-;*M66VJ@]E/:]'X.5#OOWU?1/-_,>RI7VQ\D_1>#[$9W75S^X!XNZ
ML5TK#&%\U;X<N_ZDC&5D!;<R$GTGV)SEPVCZY\3R;L":;L!";I)9SQ)CZ<O=
MPRAR#+6:"Y9B9>S&MXY7L<#IV.!Y J>7O\#>*B'5XAKXP;8SIL277C^LWEE 
MOL"^8AJU7GWQ-P8T*1B!XSE1!3E,6&Z1%=Z'^QCCC'<RP.;\:_'HIKZADDQF
M,LJPHOZR/H#/HWNP-1A (&%_Z"O#.]9B=XD0U4?K@G[5REA=A)_!*:B/-HB4
M#$(IM2E2U4RWI\C?HX2E>O9@OWF0!Z7I5*1<X_WAAP5=O_]T?GTF%)TX%K^!
MK/=CW_&B==^_]_%4BZ13WVPPHCI82V2YCY;3D[-9ZQNY5%?@AI-X .2Y7Q^Y
M-1Z[$VAU[XS'R:)7G8/75HL?U"#MR \F>].%(<XBX81"CL;1)&.,I;-^Z8_?
M!=9('N*<Y\OVTF9\KHFMY_L*?N/*JTB.#W'&BZ1[:7.^H(NM9_W3^1F$0(<X
MXWF2S>;-?"&S/=5#P4PO?1D'BX'(004@@51,"@*I/+F7O@2QMQAI'>((JW=.
ME+L62X^;_RC]5]K%Q]A;6.:AB$-ES&]=1WJ1&/E]*=Z?78O7?3FP8C<J3V3L
M0*3<!B"KIZ0KC#+O8E@#7\3)Z6__^OU8_"ZCZ-&32>_!"?P1#,TPC'4^*[1]
MWY/_5=;H:LK ML96#[QFY,APYYW+!Q!Y=]V>RVCH]T_AU#L!N5VW9]GWRF&H
MS[ *E =;# \7/RLC>;UN!2L,3IS0ZB4[R"*K9!3806 G%KA(X<6CG@Q$!$PE
M,-A%_S/5]^:#1^E_G4SX7BIDJZ9-M$<>+;W#QY">2# CW[9RIV<G\__;PN!M
M.QX[8+B.)P:Q9ZOT[98&K-NZYNF?9?U2!CVWJE)>KK0"Q2L:JH1( ,'<(]<=
MC8?G_$GGO(5WP OD._6_,P<1QK8MPQ#V?1$%\<ZF6I-!K482!9F+W<41FX8(
M]-W_&@P=UD0TA$GOJQT]5&<8V2^-")( 6/%Z<PN\KA-ZA&W.M*(:&*[EW1HI
MJ=B&-DG'Q^KX1.C%@TF$T2H_AZ":#]=2PYWJBT)WZ_H].% &<B #Z:E$,\1,
MR3D9W==,\L>TS/S3?YL4!69V8$1#)^C?@#F,7_\H1DD41NAS$Q^X'#+@]A9U
M^B#.0=)\.],KZ<*8.-+M4]0V[7#NX1<L 1QDJ&YGU%*,,&I,SK2E6UW&I"]-
M.8[+/#0@!00I[6RZ'U-,\PT&V4&JF!5]X;5]O:!DY>K2[A#.;DI?4?^$.5=E
M<OQ)?XOL 62=;G]8GA]E& .GA?'NU;06#W^HD^.N>E@PFBSS/A:AA&U@9LR?
M?A;)S=JQ^#"W]NJ"L_O[<S*X.AO<-N:BR^""V/O.#*VQA:'-*5/,EI(BB7QO
M3C]^O/AX\^?%S?G%Q].;=Q_?G)]>X6UQY#]LN&7,=IM$G],U@%?HQJO@<1+V
MY1[+>U@]TQ3>SG%V=!?9T<5KM<7/!Y,=/?4T'_^?7_JUV="??FUV./V:GD^V
M6R'/)Q77;*"78L:N=\BILE6+S-Z24J=X,/.Y(&6J$M_#!!?K5&IL^#GF*= ]
M!4W\IOJ\UQD[UME6RG<<N[GCR$)'+7UY%C 9>8@PF3M'W3CXQOO3ZZ<0HG2J
M&1BC_>C'P!@&QCSKD]F+ 4DP,.;ES3D#8Q@8DT7!P!@&QC PAH$Q#(Q!T#,P
MAH$Q#(QY%@;'P!@&QC PAH$QAY(=96#,\TN_,C"&[V\UW-\R,.;[1V4P,&;O
M4\# F)?F6!D8P\"81V",/SYD8,S%Y7Z!,864_TI$E=]L-^ZGI2*W*J$*_Z53
M,^UQ_L%("A'?I+.7S*X!LVO S(F2*L-EPUNXRUTJZ*=:YA(M.,>E^F"%1-.U
M,B\Q5=@X(T543(#20JDV,"@H_#TG)7OP77H6T-\!>A:02@;C0,+/O7H6AMPQ
MY.[YYGP8<L?PJ]T?31AR]P+GG"%W#+G+HF#('4/N&'+'D#N&W"'HGP?DCF%R
M6QG)3I;DBX+<,4SN.S$TAMP]\U6 A/TQY(XA=ZMM&'+'D#M&ACQ!*HXA=R\ 
M[\60N[U/ 4/N7IIC9<@=0^X>@3%A\) [T-P_S/YI \9<R> !YFOVRK:G$&0S
M+>P9=@>SQ[ [AMT=K'>YM6]L^P#]RTGZ!LC4P<!O;"D2455HY/GPZR#?_>]0
MN*W,D%-.#,@[S(P0 _(8G+7[@PL#\E[@G#,@CP%Y610,R&- '@/R&)#'@#P$
M_?, Y!UB2;(7"NY[&8"\0S2X%P;N8T!>;G#!-?"V2J=S=I0!>2\T_<J /,:-
M:,"-,"#O^T>#,2!O[U/ @+R7YE@9D/=4@#Q;]9D8T'%^H\K8C6\=KV)Y427)
MT#N]?(C5W Q4L$S$UJ1_NH&#IQ\'H/9J7ZK3;UB]LX!\@7W%-&J]^N)O#&A2
M/@)[/(ZL\#X#&J1?_!GO1/;F_&NQX*&,XG'% SMYD)6$9\$\.3"72KXQ2!""
MPZ@H,$_1O*8"5QY&!8T2"TEZ=5RY=TC5H[V&5;]W=TCB]!POWZH2]<V2&*&P
M/#A,JB2+XI7E)-4WV_XBZET1^9'E)D#*$#Z+GA33R>AGD$WY?7"\^VD^0?V\
M42UNK"@*PEQ.-1JC*=65NF2<^K![FC@]*W0RD'#[$L?IP^[A#"8'))&JA1?$
M615 ]R42+!DG\@_)BL96D$&Q-VFBX 8VI P ^;XDFB:0#T*@=!L[H(4_%6A@
M13/+/B2Q#G#JHJ'C'92JPDC%.C-5W62 R/<O5/T0A5K/:QR 4.LG_0,0:AUP
M=P!"M0]"J,B!( 4DBT>'(HXZ4[N@+#^P;C..Q_L1:NHP05<#_U!D&DOK'D*5
M.*L*]'XD"JROAQ5?@DP)V.%0A(F<$9 ]F30968 @]@XJ S!]J*HT#9:TSCQF
M+S=$G)9GSRM=OKFZ.CT1>(H,%CF!< &+8HH,%OFGV@(NI419C/(/JT6<2JDR
M6.4[B0).I409C++/E@5,"@FR&.0>%XN8E!%E,,H]2A3P*:-99E-\MLMF@Z+)
M9%-X8BMDAJ',9$E4(9(JDU7Q*:N0'XITF6GY$2J;(YJND%W&X0C%+I^ND%W&
ML0?%+I^ND%W&@0;%+I^ND%W&407%+I^ND%W&(03%+I]NF5W1\2*;$8)BC47)
MD2&7$8YNC5WQ82"7&XILC5E1E)_+"D&TQJ@X>,]EA2);8Y83E>=R*6Z_UGU>
MG)W;?P9!5O"<!*O+\7-ZIYO^Y8NX#BPO'/C!2$"/\E@<=6JC?+5<NM(*U5.=
M7G_A5BD%[<+GZ&EB\+)1EUPMAR/_7KZ ^V<'H0L;)M1#J.'976)/3Z&59+(3
M+4QOM/=^F'PTO[":BK2^WO8O4C4<QE'?_XJY7]Z/8-5K^/6))8'-A?=OR\E/
M*ID:<B:?K?'8G4"K>V<\3LQ>=2ZCQ/QANJ1ZH'2R)]48XBQYAD*.QM$D/P-Q
M$#/XSH*I.0V"@LL=GK\#GK^S4L0 3Q]ZCSJHS2EY-&UU<_H\G"05P.Q%\SNJ
MB73G?ISC_8FX]"7)*J7G045V4/HMRR3GGP:F_W90^TJM8!CU^T_G>D8-@9SK
M3ZIWT/XND JO5E7"/,70T$9Q\]6)AC=W3G23G'7G+P/-CW6?0OPK)=KTD.5[
MXJWKJ+(%LUJ,XG4_+9ZV#L%^J549TZ7U6)41)G3;JHS)F::D0J(,!HAFN7_X
M(86N)W,<]V(OBD5;?*V*BXOSTURB-+=53<M'A!MS_N/-Q_.+/_^OTJB9M?F7
M9KV;G^><,H:]>8L!S]EVS770_:S9K5V]',)9UQ]]G!4]4;ZJF"D0_1N42:! 
MV4>IG2S>^8EC\8>#2.04-%KI+M&V&DH&0?KY/?Q,'CIVHV-A-KJY/?_TTT_B
MW9NS#R#!3^KS0N?B-1"J5 Z$)7V9[U96A$MV8->W^C(PWJK/JJ_?970BX2^J
MUD?R2X0^MNRH0*S3;[8<JX=9SCSU9()CN<Y?,LA1:)%8&W14(-8'__9#\HDH
M13E= =,__>B='Z.NE$AD!2RO$I^QT5!1I"NLY6R2'J>K: &MLM^(/%>$=XZ7
M&(G6)5S ;L-%_=CCGY?YNU"6THK:KS"YM96\;]0C20@6F-:9#-)%BN90TCR#
MA0_G'F3WA4TSN@ZL6U4> =E[6>LL!A(K>E'+]8X_7%SA^BUJF-&M@UK#92W7
M.S['H2[*6F9T#.O9F<9I2 88BG5&N(5:TG"]V]48[']C&4ND*]V(?%T$($XJ
MN2 MM;QY!HO8FR_]\,([_>9$^#%2B=?9I]L<"(YC6-X\@\7$LX>![X&0_4=I
M\8/<@'Y=B-2JTVI%ZEE!'&LTU0I#=?UE)(GEI7 -N0,C9,,SR)?O(AJB-B=$
MX]7N?>--$%@3I,]$-5]GH;*_MQ)U_XYIO<+@SG,,%?U]<'J!%6  A5B*%49^
M'/F#$;B-8&*<^''/Q3@; E$!NS/4_HZE*&!TZ5H%3XMFLRJF*6"&<V98B@)&
MX!W\KT16Q30%S#XEUPI$;B5$I>PVLD<4:2EKNFV6TY4RI9M..=T*T[$,!D::
M\3^WO,G\I(=Q8W1:+/.;/GP8;B-"20]9@BR&FU?.:(RR-"IE%N,K^2 #R\7'
MQA2J3(9)V/36#SP97,%&C6:)I<,PO2FX^BAF6T"9Q3CQ<<HZL/S*"0K9T-<0
MA13)FK:"Z!T4BK$A<QK+0 Y<\';&[S)*B_DA^.%I5IC-[[/+D39K3.FT1<R+
M0"*;AN]X!N7R%8 @LO-[ZV_1*!&PB$.Y?!]\&Y/?P-.L,DN<E?&;<WN5U,3_
M+1X,4.<:(F$V6TJ6#TV2S2J9!DP4C6N?S>3<^8;G4-0XNWMUEL?W7]@ZFP$Z
M3,:USV:B+OK^L,+AR!HCTQA$PA6VTZ+**KUS-5TF?_@^ZEDM(F4VXS-OH)( 
MDF+L9-(\UE/?@_3])+)LEFIGG 9YR-DE$F:SO7*E'..9%3?/83&R7#>]H$E^
M01L>B3I;@)2P?#]9XXTE+&)[<7%.95A$LL(JCAS7.,$]J%'>-K-S_S)P'J0K
M;S-*8.8QP=!D,;L,?(PQEK?-ZCS=;]'[&9YF]1D1,07I/=VC(F4@NZ4OZN=S
M X.!># 1OO'^E%_*FPO_D@S_*N;,\"^&?S'\"R\6P[\V8<GP+X9_93%A^%=I
MUPS_8O@7DA'#OQC^5<2"X5\,_RIDP/ OAG\Q_*N8&<._<'P9_K4)<X9_E3-E
M^!>2,<._-A& X5\,_]I$/H9_,?PKDP_#OQ L&/Z%8,SP+Q13AG^5"<#P+X9_
M,?QK_D7]?*[PKXM+AG_EP;_\,<._BCDS_(OA7PS_PHO%\*]-6#+\B^%?64P8
M_E7:-<._&/Z%9,3P+X9_%;%@^!?#OPH9,/R+X5\,_RIFQO O'%^&?VW"G.%?
MY4P9_H5DS/"O301@^!?#OS:1C^%?#/_*Y,/P+P0+AG\A&#/\"\64X5]E C#\
MB^%?#/^:?U$_GQO\:T&NI^"^V=#W#/\"'3T+^%?H%N0B;^VJNG#<&FI5[W;R
MH5:.7YTEYC=F-+ <=PG#1N]DUZ"V0T:7_2"NATXX'7+J)>'K@PPFB3U@U_A4
M9:E#_KZ!;JN]DD$Y#%1CH%HQ2P:J%0/5\B7 4S/0C(%F)9U_WT SQH,Q'JR,
M/>/!BE@S'@S7^.GQ8 S78KA6"2.&:S%<B^%:#-=",&2X5A$_AFLQ7(OA6@S7
M8KA6$2O=2"J5[\0S*&[.8*T,;@S68K 6@[48K,5@+09K6<\3K'4E S@$BY'?
ME^+]&=?KR@-LA<'#LP!L<;VNK&;[1E1E_<.Z6*[7Q3"H<K$8!E7*]D7 H+9>
MPEROJX@!PZB*&#",BNMU%77+^*QRAHS/0@K!^*SO"Y_%];H8 ,8 L#)N# "C
M,64 V,8B, "LB"$#P(KX,0", 6 , &, & / BEAQO2X$ X: +?%E"!A#P 1#
MP!@"QA PAH#M! )V(@<6J#'%@(6.9TMQ:]_8MBKZX_GPZZ!@!>Q.JMP&R;0G
MJ"@E47COC,>R+_HQ#,$7__G/?["&NBV0)NEFCM#:3A9&X3 *AU$X6-:,PF$4
M#J-PL P8A<,HG*)N#P"%DP7&WHP[PW\8_O,$\!\@77L6 ,<13\:((T8<,>*(
M$4>EK!AQA&3-B*-UQHPX8L31YDP9<<2((T8<D9DSXH@11_EL&7%$ZOY[J&N%
M#QN0!(R=0O!E[!1CIP1CIQ@[Q=BI \1.)9W=I,V6 5*?[V+PFNE?OHCKP/+"
M@1^,1.2,Y+%H-!NM4?[.>#U,L4XBI5>X'<<[E#$GC2NJ\7%^HWN89.D:):TJ
M8S>^=;R*Y44P$@\,I)</,TL@3,H008]47:1_@HD*_3BP95B%$Z#T^F'US@+R
M!?85TZCUZHN_,:!)P0C4WEBF#. ^=EQ92962T3KY.+KO.P$,,TDR]05\.=8X
MY0L3!!VGBVQ9IL_#25(ZR@:9D@$HW9OMEDAUF-0S"Q6&;)]"[EEQ<X-"J*ZY
M+\7E" F?^K"O1/*+.%'_5S*"[I)P>O+$DUKU_&BPANQ:^A+$WN$NH"RGN>B[
M\O?(Z;\=@%%5- ?#?O_I7,^PP66Z_J1Z!^WO EGM.5Y5"?,40ROPORMF4>E9
MD3T\2..HWCF1H0#+>[42B.:FF_,431TG12K?NH[THGE-3?&ZGR*L?WP2H3;3
MR!.7UYS.Z6-]39C/;>MK_J#>6RO#&;+="A0HVR]^A;'Z3=6UO-LJS*4*)]_T
M^XY*I5NN<@$_;5J6\@?E018EB;TPLGJ@515[#X&A\ >1S(_=2P0SS6+)2L@;
MS>W(NUN1-VO;D6\W]F9]XUJCIZD-]T5/VA8L"IC#QTJGK>X17B0E"'845Q/8
MBT:GWZ(4LE1.6C""QVJIK0:"]1RT?R)#B&;Z;R"^"*;XZ2C>M%9LUK_U328Y
M\SV>F/W@UK#&%G@<8V@%X((FAA+1N)6>#!P[3!\P2''EF;F868?7R9J$K>Y8
MU,V?Q3O+<6.(ZHY%[6>1W*"D'Z]AEH1TK7$H^\?"-!H-B#GE>IXWJ]LVMMN:
MH;#<R&[-%EY:LW.$[?8(VVO#:+3:V%X;>!6TFB:V5[0&:D:WT= @:\=$ZQ5M
M6S6C?H2V+;.+[[;1KJ-5T"2LA"-TMP0=U/#KBZ""6A.O68JL: W4*;VB+9;4
M*WK-HFV U"O:OY T0'"QM3IZS5(T@.]5CZQZ>NUHZ97@86MU/3;0V:^L),O2
ML<L29*7XUQ9Z[Z;,%GXOH'CM5DN'!C2M6#VK0$^O6G9#/9UJ,=<6VEPIO39U
MA)HU? !+,@&T7DD;#-I<S9J6O8#D!]#>A>*U\=-%V6%,]*&3-%UH#9!VP_UN
M!28Z?C6->A/OM"@&B]]D\=+"\9"PO-"ZK1MM$Z];PA&9D"<AG>30OH"2?6FA
M>VVB)ZQN:(FWS28^*L*GR^I&MZLC_T(X>9N4_0N?TM C+#X3J835DBEI:0D,
M"%E3@NLRC] >L4[(&=8Z^),7(>HT\4DH4BRKY9"$C^0TI;8H^:(NWAL0=&#B
M(V]*>-1&ZX"@ O1&0Y&T@P\,*#:POM$\7_B!/%SXP9VCP*&^\?[TF@$'^8 #
MR8 #@F ,.&#  0,.GA)P4._B(S$*X "?HR !#LS=7P@VC2X^^T,XEQWAXSN"
M!MHU=#R.EA5ZQ<?CA%B,8 .$(V2SAC_RHS. =<I=,R4<U7.(UA(XH\V5<B33
M<B;%&Q8E!8P'"%$.CTUT1I%T:Z,%;H'O5<\-DQX-4,ZD>%DI&;JFE@O1IA:P
M 7X5D"QK][L6R0^0O"NZU_W?L^YW>]&S7DF]ZI%US[N6GEXI&L #>TF]:KEE
MU0.+0+MLTO:"C]QJ6F(,$JA5SUZH97M!&Y:>8( DJY:T=P=_34.!&G30ED6"
M&N#="PEJ<*3A]KYNM/'/(U"@!@2,/PES@M8!)>]RA ?=$* &E)M0RK4M'H.*
MSY0U*!=6%(?8QN\)E 0<'GQ%$A8]812L 4%8R@:&QX90(H,VWB42?%>]B]<L
M 6M@$O""%*P!85_0XKM('A&O68H9H$_?),B))JQ!1\L-?G?WC__5C [>S1)D
M-;4</3)$?;9@ W]\^&"#BTL&&^2##6 &&6R %XS!!@PV8+#!$X(-&L:1J05M
MT";L[NC@N=XR6C5T0(I/JG2,]M'NC[WJL1!TKW@=&$?XR!$M:\=H:<%^-O'@
M<CS@H G=:BAPT##PSX20;O%UG*1-/4_*XI^0(X' ]WO:(Z6"=9R?-*4]=.3"
M33UW-WB71<K[:('KZWE^"7_11M*K%EFU7 AUM#PFJP5O@ ^)M"Q7DL-&]TH9
M?TT+,@#_["U)K5KNQ?5D*/6@&/#7%00-M/ UI"B]ZGEV#1^XD6Q "^" @+BH
M45R6CBHO)AYX1'H\=L^A&VFZT-$[159"&0+"9;N>X@;M-CY#0+%8_*.\>&GK
M1BOC:<.\;M&Z;8#CVOWQN ZK5H.P2K4Z$ =-?+D?/.+ -(TNWG41G$R#<.S&
MY\M:1A</ZZ$ )/"7PA3(04L/FH/@$ A6>Z1E"VNV=9R]"<4S*'?-'3P2C0(Y
M:.!OA?&0 ]-HX4&.I'!6#RP;/V$4,]!2Y:*NI>1-&P^3(01(#;S)HC70-MI=
M]'119-7RF);Y/=4W<+S#A1PXZJU7XT#"3X8<Y$(.0$L,.< +QI #AAPPY.#I
M( =U@U <#1V1FT8#CX/& PXZE =Y\$F*>AT"'/09"GTR:W2,-CZ[B%="P^AH
MR .VVG VV_V%.QS1"5$>^B#9,/ /A^ A!^T6!;]/B$D[6DI>$YX1HIQY=9S,
M-/6*QYT0LL&$7DF@;1V7>!V\N5(T@,\HD635<378P3LMPM&TT]G]?J L2T?R
MJX-/)%!DU?)L9P?_  M)K^C9(KE7+2L6;UEZO#9) SK01P0-D%:!CFMW0J^4
M?8OP:!3%!G9_[6YJ*<UBDI[II&A !TBB@[^RH.PPA+QZC;)DM;A"_+6['K=-
MVF)TO .#$+Z19-42PN.Q0A3@01<?O>"!!R:E2A->VJ[1-O'=HG7;-!J$=T 0
M=-#%X[ HAH!_9)KPP(.)AX[B@0<M8_>U5$RCB8>.DE '1_C':0C2-O"W;'C4
M@6FT\&=$DK"[!QV K+O?O< *-. 1E0+PF%3"52L!D(C''-2-%N&)*@+F@ )&
M(ZA6P]M"U9N#=P\B)BU:O!DTC2-"'I*@@R/\$T7HX BL0,-;2&$EX)\M1,NJ
M7MZS^Y +7$S&BVN>+>@@#!X.%G1P)8,'&0@EGGA_QK4.\H$',(L,/, +QL #
M!AXP\.#I@ ==./3BLZ"$=%T3'^+@D0<-"!SP)=@HI0ZTG"1-_)40X0S1Q(>Z
M:%G;1EW+:P4:^*L+"NJ@17BY!.'5"ET]M:_Q+RR@% W4$$!GOY4LSQE0>M4#
MB==3 1[MMRBU#O24J49G@DF/I&LIRZ"GU(&6:H'X*R%2J0,M"M#RHE;\+3;I
MZ4X]51FTO%D ?]&FIS*'GL>\]Z\!/<4.M."D"/9**G:@Y>U%>$=(T$ #_V@K
MH=<Z/@6^_Y<K:-E?"&7::SHV&(H;T'!I5:.\PHRRP>"C3%(TH"?*U%%!NDYX
MD1T!<=#$(YQ)I0XT5#IHP#D6WRVAT@%!!Y3["D*].LJSE_AZ,H1*!W6\"@B5
M#AH&?H%1"AW@A:5!#EHZ7F9&>,4ZI="!EN)B>$ /J<P!'HU*V+Y:6DH@F7AX
M!.7Y=LHE/J',00L?&%#>K'"$CXU(X;$.6':MKJ5N&?X5"+0W*^!KZI!JSNJ 
MS];QWH" NFAKB;LII94(O=;6>WVVD(-;^\:V#Q9T<"('5NQ&*>H ?F-+D0@L
MG%!X/OPZD Q$R 4BI*K:'HHPOVEMU<TGAQ_P3?6+O:E6R$$M-]4F/F^ OZDV
M(4Y&'\((Q]N&EM-2"U]]@!!Y=O!'<8*L1WA9*:F3C&T\KU?" 02?Z,+?4YN$
MA^Y)]PA:7E*MY4'^&CXS30GHZ[M'4:M>M10.QU?>I%Q3:[GZQ2.!2 K0<J6.
M/W_JT0 E,XTOB$?)S>,-2\_%'TE6'84G"+U29,4[;8I[Q=L R5ZUU"/'YPI(
M&M!2E5_/*M!RH:IIV\+C+$F;X7YOZO5<_I(6@1YSU;*_:*G)7\,7=2:Y 1T%
MJ DNB[+!X+<"TG1IB3/Q;H#TJF-\CIMP45TGE+>B6"SALIX0;#<(JB44$NS@
MG8&F\[$>O#$E]8(O;X2_J:Y37B--NOO%AT7X9%G=Z.+# A)T1\=%->&-#UID
MI=Q4US*>,=W!_H7'%5#B@@9>!90K2KP**#?5%. UI1P]_NQ)BF1UO!E44RRO
MQPP(%^ D]!)^%R?A^+24D\1OBZ37*VFQK;**_.DM\.)=]?)M8<H^;05"!)87
M#OQ@)-1M&BQ)TVR.0@)!O7'4H1'4.U2"(Y-(T*82-%8)EKXDU[?Y&DT_SZ[D
M?LK_5TPE_KEX61XF%X.BE K%J^0&\:WK2"]ZK /PNI_>T?\H+M]<79V>E)#?
M@68=SS?>GU[3""XND02+;T= $:Q6-D 189 )&1WE]GKI2BM4( &O+_HR@@4N
M^[ \0^ 1BMCK@X!/BPQ1:!1I1WXP,?)'$/FQ/:P,INZHHB .6>9N^^/)%_$6
M?JI+93.%0D2^OA'E2YR[,)?'5?SGW_YU]N%$O'MS]F%E>K<<D/%MY![7CUK'
MXLH?S4HN#!);R!?FVH\L=^J<S$9-C$ I0"E2@*GO]9>U\1Y^BH^)84'[5UD3
MU&VVDRD*47,T-=)J D))%/MJ.NU_.6/0E6JD>H5O"'33>F\W]5KMJ-:HFS<U
ML]XQH)M7KZZ'L,]]DW:L8!'3B1!?G6@H(OC+P'==_^L4>R/'JLUQ0K+P![5I
M"M^VXR" A?9UJ"QRVB/\.1K",@;K FLND-CJ6V-8((O"SGZ7S&2G=JS*>( G
M^*I^/+82LQ7SZI>J]>LO5?!6\+/G]R?POV$T<G_]?U!+ 0(4 PH    ( -0<
M=3CS5_TS@B$  ,:# @ 2              "D@0    !E>&5C=71I;VY?;&]G
;+FAT;6Q02P4&      $  0!     LB$      
end


Mime
View raw message