harmony-alerts mailing list archives

Site index · List index
Message view « Date » · « Thread »
Top « Date » · « Thread »
From nom...@intel.com
Subject [build-test alert] FAILED Windows 2003 x86_64: jdktools-test debug
Date Mon, 17 Mar 2008 19:08:01 GMT

BUILD FAILED:
	Ant Error Message:
C:\cc\cc-common\scripts\cc-exec-adaptor.xml:104: The following error occurred while executing
this line: C:\cc\cc-common\adaptors\jdktools-test\adaptor.xml:24: The following error occurred
while executing this line: C:\cc\cc-common\build\checkouts\hdk\working_jdktools\build.xml:242:
The following error occurred while executing this line: C:\cc\cc-common\build\checkouts\hdk\working_jdktools\make\build-test.xml:98:
There were test failures.

Date of build:	2008-03-18 00:52:36 +0600
Time to build:	15 minutes 18 seconds
Last changed:	03/17/2008 19:53:39
Last log entry:	hdk

***********************************************************
Errors/Warnings:	(58)
            
Result: 1
========================================
Testing jdktools binaries...
========================================
Compiling JPDA tests
Since fork is false, ignoring memoryMaximumSize setting
----------
1. WARNING in C:\cc\cc-common\build\checkouts\hdk\working_jdktools\modules\jpda\src\test\java\org\apache\harmony\jpda\tests\framework\TestOptions.java
(at line 505)
internalProperties.put(name, value);
^^^^^^^^^^^^^^^^^^^^^^^^^^^^^^^^^^^
Type safety: The method put(Object, Object) belongs to the raw type HashMap. References to
generic type HashMap<K,V> should be parameterized
----------
1 problem (1 warning)
JPDA exclude list: C:\cc\cc-common\build\checkouts\hdk\working_classlib\deploy\build\jdktools.jpda.exclude
Running JPDA tests
Debugger JVM=C:\cc\cc-common\build\checkouts\hdk\target\hdk\jdk\jre/bin/java
Debuggee JVM=C:\cc\cc-common\build\checkouts\hdk\target\hdk\jdk\jre/bin/java
Uncaught exception in main:
java.lang.IllegalArgumentException: Characters number for one byte must be positive.
at java.nio.charset.CharsetDecoder.<init>(CharsetDecoder.java:160)
at org.apache.harmony.niochar.charset.ISO_8859_1$Decoder.<init>(ISO_8859_1.java:50)
at org.apache.harmony.niochar.charset.ISO_8859_1$Decoder.<init>(ISO_8859_1.java:49)
at org.apache.harmony.niochar.charset.ISO_8859_1.newDecoder(ISO_8859_1.java:41)
at java.nio.charset.Charset.decode(Charset.java:673)
at java.lang.String.<init>(String.java:264)
at java.lang.String.<init>(String.java:203)
at org.apache.tools.ant.taskdefs.optional.junit.JUnitTestRunner.run(JUnitTestRunner.java:319)
at org.apache.tools.ant.taskdefs.optional.junit.JUnitTestRunner.launch(JUnitTestRunner.java:672)
at org.apache.tools.ant.taskdefs.optional.junit.JUnitTestRunner.main(JUnitTestRunner.java:546)
SAMSA exclude list: C:\cc\cc-common\build\checkouts\hdk\working_classlib\deploy\build\jdktools.samsa.exclude
Running SAMSA tests
test.jre.home=C:\cc\cc-common\build\checkouts\hdk\target\hdk\jdk\jre
Run jdk/bin/java -version in C:\cc\cc-common\build\checkouts\hdk\working_jdktools\build\test_report
java version "1.5.0"
pre-alpha : not complete or compatible
svn = r637890, (Mar 17 2008), Windows/em64t/msvc 1400, debug build
http://harmony.apache.org
Run jdk/bin/javac -version in C:\cc\cc-common\build\checkouts\hdk\working_jdktools\build\test_report
Run jdk/bin/javah in C:\cc\cc-common\build\checkouts\hdk\working_jdktools\build\test_report
Run jdk/bin/javadoc in C:\cc\cc-common\build\checkouts\hdk\working_jdktools\build\test_report
Run jdk/bin/jarsigner in C:\cc\cc-common\build\checkouts\hdk\working_jdktools\build\test_report
Run jdk/bin/keytool -help in C:\cc\cc-common\build\checkouts\hdk\working_jdktools\build\test_report
Run jdk/bin/unpack200 in C:\cc\cc-common\build\checkouts\hdk\working_jdktools\build\test_report
Compiling TOOLS tests
Since fork is false, ignoring memoryMaximumSize setting
----------
1. WARNING in C:\cc\cc-common\build\checkouts\hdk\working_jdktools\modules\tools\src\test\java\org\apache\harmony\tests\tools\javah\Test\Test01.java
(at line 24)
private static final long xxx2 = 1;
^^^^
The field Test01.xxx2 is never read locally
----------
1 problem (1 warning)
TOOLS exclude list: C:\cc\cc-common\build\checkouts\hdk\working_classlib\deploy\build\jdktools.tools.exclude
Running TOOLS tests
test.jre.home=C:\cc\cc-common\build\checkouts\hdk\target\hdk\jdk\jre
The test report is in C:\cc\cc-common\build\checkouts\hdk\working_jdktools\build\test_report\html\index.html
The execution FAILED with the following exception:
The following error occurred while executing this line:
C:\cc\cc-common\adaptors\jdktools-test\adaptor.xml:24: The following error occurred while
executing this line:
C:\cc\cc-common\build\checkouts\hdk\working_jdktools\build.xml:242: The following error occurred
while executing this line:
C:\cc\cc-common\build\checkouts\hdk\working_jdktools\make\build-test.xml:98: There were test
failures.

***********************************************************
Unit Tests: (60)
        
error: org.apache.harmony.jpda.tests.jdwp.Events.SingleStepTest vmcrash.CrashedTests
Unit Test Error Details:	(1)
                
Test: org.apache.harmony.jpda.tests.jdwp.Events.SingleStepTestClass: vmcrash.CrashedTests

***********************************************************
Modifications since last successful build:	(1)
            
add cc-hdk log20080317195339Lbuild.530 03/17/2008 19:53:39hdk

begin 644 execution_log.zip
M4$L#! H    ( /P(<CA8K#K]2 T  )LX   2    97AE8W5T:6]N7VQO9RYH
M=&UL[1MM<]HX^C.9Z7_0[-S-)C.QPDL@@:/,Y))VFVS3=D+:_5!R&6$+[,2V
MO)(-87O][_<\D@W8$$*Z3C\=TQ);UO/^*EETW3CP>]VA<&:];B1YK\N(BF<^
M?_WK2(2QI;R_>(<<5__YKU][KW:2R&$QM]0D[+S:>;5C*1XGD77GW,="^,J:
M*C.<3BN.RP3!SI+(]VQX[I!(BCMNQR1D 2=>2+P@$C*FY%,Z?BTBZSV?<!]G
M1ES&,^+PD1=ZL2="9:X!S<B3*D;XT\[ MN&?98L@$.% V=*+8C5(H3VNZ$/@
M$Q8ZA(T9$ER%&2:>[PQLE]OW(@%8U[D?3(6\]\+Q;2;0(&#WO( 5!8RYBD%"
M@I^OW';%#=EYO>5GYQJ @0C)B)"A%S*)V"G='@NR8?N<A18RHRR0(4IBK7Y;
M1#/K3G)KY/G<6,1V ^$4Q])IG4PB"^8DYJD6++AW/'E#3B771H2;SH]IT4Q"
M$K>2H^5?CH!"8?2MT4O!2J<BB#P?M7_QZ>R$I! OQLS ]IE2/"-QQR;,7F:B
M?E0C2B32YD3;A<3BA6CVO1") !SQ%!DQ7_%]XHU#(9&/@ ="SB[9@Q<D01\R
M 8& 1R?-(['FG_QXC9(_3JX^G'_X[<<#S;C>X XRRD!)6\LR0/P#(<<#%C% 
M,'"9!(PS,\M(.Y*04Q#= ./J8Z0S!D7 /(]DE\4$E,Y)L]K<RS^K>&',9<C\
M3XM(AV#:Q72U3R;,3_C>OPH@_WGZDX>XGD6@5C;B\:Q#KET.2H]= ;D1"'T<
M8AK<)^;O'AER7X1C[0XQS)1L2F($?\>4>\DB2J[XB$L.)M5SQCSDTK-S<[J_
M[W_I$>6*Q'< 'XD8*@K$!.LZ6YH5L_'0YP'9K9$IDR%8; _C"\H'H.,6?[#]
MQ.&%&-.1E3X"C4.F?)9+:/?UO>' X9$O9NG<S%$HFIZFV--:LS;2KY(P7!?G
MV7-"SO@P&8^Y)!=?+E]OPV',Y)C'^O(._TM^ *G[8.%K*[AY>;B_WB50#A=R
M0510$Q4TC0JC&BTJO7.F$?WBR3AA_B5, K^G7[A4$!P8)GF4.*((%FU2VR=O
MF><G$JH J>Z3-U(*:2ZO/:C=W&>1X@XT"K3>/H8L8?]]5$>T6FN5A:I>:Y>%
MJG94+XVK:J,T5(W#T@1L'I7&57,CIL:VF.HUVCS<S%5]6URU0]JHE^<-M9_E
M5\]15NUXLX"'V^(Z/*+MX]*BL-HNR4E;P-5FUWH&5\?E>4.[L3GYM;;6>Q,B
M>K.$SW'X:JNTG%4]*BV_-TODJE$:JD:MM*3<;*S)#I]#FR5C-\9>B.N^%+OC
M ):CG?Q$+/+49^&8GOL^'S/_1(Z3@(?QFPP0.B@H\LR&]DV1, F&T+5 +T\$
MM+/#60R]9 (+8^SRA((U\X33/(4*]+Z:2N@):@,J:._IJ?E[QFWA<$F[N-SN
M[19&$:I3:U7W5A&NZ4  /6*?DSCO?[P]/FZV;VO_*)!9/#$DFB].X;#]=RG0
MD$]3(JO8:VNP/Z9RZF@LF:X-AM91XS$4VC?Z,2[5,NG2.PU9;QW^*&1U'<TE
MI9B>FX4QC9FZ=_A(4:$]DOE40]"+S_"-48.-*6@?0F>W.*9I-6I/&.#YM'R6
MA+:[GESKJ%XV.0S=]<2:AZV]=7GD[<GY^S=G937P[X3OO)E 7E#E]/"U6GF-
M:>N8'E5+ZA^.::NLUAM054LJ^H"J69J S?**:UF-*5BP]40W^1Q=E<15B5I'
M 4N2#U'52UH\E2@A]*6E28BK\E3"5SNQ2&S7&J60>@^YLQCG&LG2Z&(ON?/T
M=E'_Y++_@OM%B@5J:<,(Z=H".C/0RP<!9#VS&6^V7_&%02A(" )PA\3\(=XG
MCL#GH8A=O1_Z](Z3$6C-EA,.T3L)^5X$_ =WA59(XFN$^581L29FD^>']V$?
MV:H'@@_<OB$GNF"1=Z9@D?>Z $,SVB&[]AXY%=%,>MCRUMIM<+5ZM7JLMSI3
ML+X8Q5/P!/)6)*'#=$L,7:P'WNE[-@\5N-$^86"'2+\Z&OI9(YO1UT)F,OY2
MHTU:_87DIX"W6<R/7 9,@=4(2!_Y''IDH(370!;PYF'4)"2OB6PUCH[;$ J[
METP2\'[D?V^?_.&%CIBJ QZT#N.#0$UL6&I589Z#NWQ$JRR/SXWCJ'-PD-7U
MM,Q#Q=]L/OO%[??&]CT(<'*!>C3O(<!Z57IT!.9JT 8%J196//_W)=S)"!51
MU>8\HN3$]XE^#"F%*RXGW*&;Q7)?2IJ+#^>6?H=)7,X<7!/I*-;;X2P6LN \
M^;O/BHUY9UT;EFXT(^?T$M\>?C6-H;HA79UM]'M,U=N$?0Z2'R;$&@H1:RS@
MB2[IXG=/!\D8UFTAT:-3#Y2,RSF0FH<.YB)11+3^@Z\+H)=EB0^>KWE%A!L5
M 3RM\(.?1WB"V/P9+ G216OV<JC0]Q"=>=DY9TERQY/<QISMA<]A2T7<]D:>
M?K6\DFM66')(U] 1<C;G*V,IYX$98W;Z,A%\*$=N.P[GQ,C4]6QW%>L(4B>^
MS@NYS95B<O:4!!XN68IDSO5@^M9PR?4$(@4R+(E% %G39K[_) 7(7T,!":9H
M-LB?V('H HD9 %8Q3_&;B[5E;+I)(&*D=3I*@"OR)RR3C"&7@+;3LL+F1.MS
M.",,;,3LHB=<<07."]W3YCSG"/O%,AV@/T/T2M<T#TL:ZA"XGO%X$UM03L9H
MWQ=C3/8- 9?[$5V78BL+)KZE6?$[N3BYT@TC ;NQ@J66 -"?O-%L#> FSTFA
M*O A*0(P+&)T$)ZLPEOW?*8@U#CI9E>W.A-6B"_LM%,Q#I<]+R#08_H%[ (#
MW@(&/;H%=(2>NTQ?*3"' QCFW&5CJ]S/@9?@*A#%W@1\&Q',8<DN) ['&XUP
M,W$D1;".YEZ10:T],(Q)R[<88$A G^A)9=NL87BJ#;X>GO;?ZNZ;GD'OK)/H
MJDEU8JEHJ<3$@\4"<QS/[-BD%6&%I \QD@<!D?DT*R!P%PFE5AM"R^82&ASM
M08ZG(I_-" Y!CL$338KL)L#+U(.ZF+DH<I]Q6=1>K!CI7O=/;C]?O>\ASIQ3
MP<(+'( %$:9:5T@OGJW"(W6# Z]N==@L>X8>R"P!TY;9+6 #73S,2-<5$-.@
M0NCB5.];IXO!W?NN506/=6<'40V32#I)BXBS]@FG8VHF4C.10D[IU.J-PW6T
M3%C@]]SNRS&1([C[[OKZ$_;J_8^GO_>+BDS-*$V6-Q4"T2VR/B*UY2R*Q5BR
M".JF1@RKB\P%Y",H-7 WXR\;U3B+T:;6L_$L+O3^?<!"-L:2^$A:6%#*<[?(
M!QO8A( KBT^L"L;;,<99C+L CU/+\SJ'V,@L>FOYW"Z'[ :"RPPOPVSD.'#*
MYS? -FX,[;(WSFT?%"GF-9R'>H3IE=8 ? @K/+&P<+]4>Y"_^STEF>B^(/\L
M8^>;U47ZD&I,KOB^/&*Z !SKFLM;?3BK]YU22JR++G9AV:2-C(1B&I(4JRIP
M4M&^(?F?E<IO9B7)<TX!3Y+Y_OL2$"K*EGZE<HI7^7(A^23+^)#IXZ38\8#.
M0\A^,0";BT6(QP+RKHA=XRS0B!=!'8[;&U!5KG@@)IQ R8,E@R[LZ]-*Q>(/
M:"H >:,O<N(A/5V!,0FKV!'%LEJQ8($-F &\SV$MHGG%R:;)\&2V  =IBY#H
M:P!W[4(CJ_TN\UUA&D@""F*988K YM0P@)_K"YRXQ/>N[<):?0\Q,7+:OP*=
M1_ZLB -XM'T1@KKFQY-A.G*NU;9FNFZ)'+0J"\?Y3JHX&[JM,+:U&3_A)>K2
M:+# JS;.:H]4L13W1P;!W/6@<X7!M '+8=$I8[Z#"8RM8,NZRCS_FUK)RJ)W
M_I)USLLTM9(WA=8[M.*F #?YYELAR@O;5-!>="H%$.-UC]!>26])" NY^WJU
M^E*I+=T_(@M"7RU(/9B)_DLLRV2AUSH_W>#@ \5Y7^GXKQLRH]!)Y]'MOL5^
M  WCA2;. 7P?U\Q+%"RMB;UUF^S;G'F^_OCQ?3]WZ'GE1'+S_^>1<^>1S=V3
M!Y*-I&:RWCC4IY'U5[6V\31R_;!X&#E;LV&A@)9AY.'Z!L\#DX>'ASIY36K%
ML\CDT<^:8\BX9^)QWR$I<QJIWD3"]EMRYNC5B9_ESA<Z)6Q\\<5>^YCOG_G:
M9R6XRG_ML\41@H7T2>SAE3Y- (U7'Y/^>X&;E'T&EMYXA&#K(V?M\DY1U=JT
M7=_\VG]KMJJTFIW(^KLO+TU?9T&FLG@0Q3,SF.Z.SH>07].'W9 S_(OFJ:7N
MI:M]624(XRI/^]4.[H%:9@+<&\696U"?9*'"@J+W&3JDT:@?!P4/Q9R 1(@!
MPFQ06M$<X._.!E[H\ >*E\BO<N'!@N%7.U#:EV^-RK4EI-EZ?;6S@TQBJ4QT
M%VU.UI@62&\#"]QC1JW/3]MU-,C2 [0T$;:=2 EA/G6QQTTQPN,8>U),R4"L
M*#IS&"SBI)KG%\U<-HR_"NO4#\VO.DJAM[VJ4]KUGTU<_S!NT7-H-MK'F@MH
M8:;XI3TJ"SL*9NT>L%[W0/_V\,#\#O% _RCQ?U!+ 0(4 PH    ( /P(<CA8
MK#K]2 T  )LX   2              "D@0    !E>&5C=71I;VY?;&]G+FAT
8;6Q02P4&      $  0!     > T      
end


Mime
View raw message