harmony-alerts mailing list archives

Site index · List index
Message view « Date » · « Thread »
Top « Date » · « Thread »
From nom...@intel.com
Subject [build-test alert] FAILED Linux x86_64: drlvm-reg-test debug
Date Thu, 13 Mar 2008 16:52:04 GMT

BUILD FAILED:
	Ant Error Message:
/export/users/cc/cc-common/scripts/cc-exec-adaptor.xml:104: The following error occurred while
executing this line: /export/users/cc/cc-common/adaptors/drlvm-reg-test/adaptor.xml:67: There
were drlvm-reg-test failures

Date of build:	2008-03-13 22:49:23 +0600
Time to build:	2 minutes 35 seconds
Last changed:	03/13/2008 19:51:14
Last log entry:	hdk

***********************************************************
Errors/Warnings:	(124)
            
[junit] Test org.apache.harmony.drlvm.tests.regression.h0000.DirectByteBufferTest FAILED
[junit] Test org.apache.harmony.drlvm.tests.regression.h1578.NaNTest FAILED
[junit] Test org.apache.harmony.drlvm.tests.regression.h1654.H1654Test FAILED
[junit] Test org.apache.harmony.drlvm.tests.regression.h1748.IntfAccessTest FAILED
[junit] Test org.apache.harmony.drlvm.tests.regression.h1788.abcdTest FAILED
[junit] Test org.apache.harmony.drlvm.tests.regression.h1800.ExecTest FAILED
[junit] Test org.apache.harmony.drlvm.tests.regression.h1802.UnresolvedParamTest FAILED
[junit] Test org.apache.harmony.drlvm.tests.regression.h1802.UnresolvedHandlerTest FAILED
[junit] Test org.apache.harmony.drlvm.tests.regression.h1840.SimplestTest FAILED
[junit] Test org.apache.harmony.drlvm.tests.regression.h1840.SimplestTest FAILED
[junit] Test org.apache.harmony.drlvm.tests.regression.h1852.DivIntTest FAILED
[junit] Test org.apache.harmony.drlvm.tests.regression.h1857.Test FAILED
[junit] Test org.apache.harmony.drlvm.tests.regression.h1861.Test FAILED
[junit] Test org.apache.harmony.drlvm.tests.regression.h1863.H1863Test FAILED
[junit] Test org.apache.harmony.drlvm.tests.regression.h2057.SyncTest FAILED
[junit] Test org.apache.harmony.drlvm.tests.regression.h2083.Test FAILED
[junit] Test org.apache.harmony.drlvm.tests.regression.h2083.Test FAILED
[junit] Test org.apache.harmony.drlvm.tests.regression.h2084.Test FAILED
[junit] Test org.apache.harmony.drlvm.tests.regression.h2086.Test FAILED
[junit] Test org.apache.harmony.drlvm.tests.regression.h2092.Test FAILED
[junit] Test org.apache.harmony.drlvm.tests.regression.h2092.Test FAILED
[junit] Test org.apache.harmony.drlvm.tests.regression.h2103.Test FAILED
[junit] Test org.apache.harmony.drlvm.tests.regression.h2113.Test FAILED
[junit] Test org.apache.harmony.drlvm.tests.regression.h2151.VMInit1Test FAILED
[java] Java Result: 1
[junit] Test org.apache.harmony.drlvm.tests.regression.h2259.H2259 FAILED
[junit] Test org.apache.harmony.drlvm.tests.regression.h2261.RCETest FAILED
[junit] Test org.apache.harmony.drlvm.tests.regression.h2335.SimplestLibraryPathTest FAILED
[junit] Test org.apache.harmony.drlvm.tests.regression.h2644.BootDelegationTest FAILED
[junit] Test org.apache.harmony.drlvm.tests.regression.h2679.DupTest FAILED
[junit] Test org.apache.harmony.drlvm.tests.regression.h2748.Test FAILED
[junit] Test org.apache.harmony.drlvm.tests.regression.h2773.InfinityTest FAILED
[junit] Test org.apache.harmony.drlvm.tests.regression.h2808.finTest FAILED
[junit] Test org.apache.harmony.drlvm.tests.regression.h2846.NoVerifyTest FAILED
[junit] Test org.apache.harmony.drlvm.tests.regression.h2873.RemTest FAILED
[junit] Test org.apache.harmony.drlvm.tests.regression.h2874.Test FAILED
[junit] Test org.apache.harmony.drlvm.tests.regression.h2926.Test FAILED
[junit] Test org.apache.harmony.drlvm.tests.regression.h3027.AgentLibTest FAILED
[junit] Test org.apache.harmony.drlvm.tests.regression.h3048.H3048 FAILED
[junit] Test org.apache.harmony.drlvm.tests.regression.h3067.Test FAILED
[junit] Test org.apache.harmony.drlvm.tests.regression.h3074.Test FAILED
[junit] Test org.apache.harmony.drlvm.tests.regression.h3098.JsrNoRetTest FAILED
[junit] Test org.apache.harmony.drlvm.tests.regression.h3098.JsrNoRetTest FAILED
[junit] Test org.apache.harmony.drlvm.tests.regression.h3110.FieldTest FAILED
[junit] Test org.apache.harmony.drlvm.tests.regression.h3121.H3121 FAILED
[junit] Test org.apache.harmony.drlvm.tests.regression.h3150.Test FAILED
[junit] Test org.apache.harmony.drlvm.tests.regression.h3175.Test FAILED
[junit] Test org.apache.harmony.drlvm.tests.regression.h3216.ASETest FAILED
[junit] Test org.apache.harmony.drlvm.tests.regression.h3228.H3228 FAILED
[java] Java Result: 1
[junit] Test org.apache.harmony.drlvm.tests.regression.h3283.JavaLibraryPathTest FAILED
[junit] Test org.apache.harmony.drlvm.tests.regression.h3285.Test FAILED
[junit] Test org.apache.harmony.drlvm.tests.regression.h3317.GetFieldDeclaringClassTest FAILED
[junit] Test org.apache.harmony.drlvm.tests.regression.h3341.StopThreadInWait FAILED
[junit] Test org.apache.harmony.drlvm.tests.regression.h3380.LongToBitsTest FAILED
[junit] Test org.apache.harmony.drlvm.tests.regression.h3382.Test FAILED
[java] Java Result: 1
[junit] Test org.apache.harmony.drlvm.tests.regression.h3404.H3404 FAILED
[junit] Test org.apache.harmony.drlvm.tests.regression.h3446.SubSubTest FAILED
[junit] Test org.apache.harmony.drlvm.tests.regression.h3505.GetFieldModifiersTest FAILED
[junit] Test org.apache.harmony.drlvm.tests.regression.h3582.Test FAILED
[junit] Test org.apache.harmony.drlvm.tests.regression.h3619.ObjectLongWaitTest FAILED
[junit] Test org.apache.harmony.drlvm.tests.regression.h3652.Test FAILED
[junit] Test org.apache.harmony.drlvm.tests.regression.h3658.Test FAILED
[junit] Test org.apache.harmony.drlvm.tests.regression.h3658.Test FAILED
[junit] Test org.apache.harmony.drlvm.tests.regression.h3691.Test FAILED
[junit] Test org.apache.harmony.drlvm.tests.regression.h3698.ExceptionLocation FAILED
[junit] Test org.apache.harmony.drlvm.tests.regression.h3716.Test FAILED
[junit] Test org.apache.harmony.drlvm.tests.regression.h3730.StepM2N FAILED
[junit] Test org.apache.harmony.drlvm.tests.regression.h3738.Test FAILED
[junit] Test org.apache.harmony.drlvm.tests.regression.h3751.Test FAILED
[junit] Test org.apache.harmony.drlvm.tests.regression.h3784.Test FAILED
[junit] Test org.apache.harmony.drlvm.tests.regression.h3816.Test FAILED
[junit] Test org.apache.harmony.drlvm.tests.regression.h3822.Test FAILED
[junit] Test org.apache.harmony.drlvm.tests.regression.h3862.SubrBounds FAILED
[junit] Test org.apache.harmony.drlvm.tests.regression.h3894.ThreadGroupChildren FAILED
[junit] Test org.apache.harmony.drlvm.tests.regression.h3908.InvokeTest FAILED
[junit] Test org.apache.harmony.drlvm.tests.regression.h3909.FinalizerThreadGroup FAILED
[junit] Test org.apache.harmony.drlvm.tests.regression.h3954.Test FAILED
[junit] Test org.apache.harmony.drlvm.tests.regression.h3982.EmptyStackTrace FAILED
[junit] Test org.apache.harmony.drlvm.tests.regression.h4073.Test FAILED
[junit] Test org.apache.harmony.drlvm.tests.regression.h4073.Test FAILED
[junit] Test org.apache.harmony.drlvm.tests.regression.h4220.Test FAILED
[junit] Test org.apache.harmony.drlvm.tests.regression.h4267.UnresolvedArrayElem FAILED
[junit] Test org.apache.harmony.drlvm.tests.regression.h4511.GCTagged FAILED
[junit] Test org.apache.harmony.drlvm.tests.regression.h4512.GetCurrentThreadCpuTime FAILED
[junit] Test org.apache.harmony.drlvm.tests.regression.h4514.Test FAILED
[junit] Test org.apache.harmony.drlvm.tests.regression.h4514.Test FAILED
[junit] Test org.apache.harmony.drlvm.tests.regression.h4579.test FAILED
[junit] Test org.apache.harmony.drlvm.tests.regression.h4595.Test FAILED
[junit] Test org.apache.harmony.drlvm.tests.regression.h4596.Test FAILED
[junit] Test org.apache.harmony.drlvm.tests.regression.h4654.Test FAILED
[junit] Test org.apache.harmony.drlvm.tests.regression.h4675.DivLongTest FAILED
[junit] Test org.apache.harmony.drlvm.tests.regression.h4706.Test FAILED
[junit] Test org.apache.harmony.drlvm.tests.regression.h4751.Test FAILED
[junit] Test org.apache.harmony.drlvm.tests.regression.h4785.Test FAILED
[junit] Test org.apache.harmony.drlvm.tests.regression.h4785.Test FAILED
[junit] Test org.apache.harmony.drlvm.tests.regression.h4866.Test FAILED
[junit] Test org.apache.harmony.drlvm.tests.regression.h4874.Test FAILED
[junit] Test org.apache.harmony.drlvm.tests.regression.h4874.Test FAILED
[junit] Test org.apache.harmony.drlvm.tests.regression.h4979.AttachCurrentThread FAILED
[junit] Test org.apache.harmony.drlvm.tests.regression.h5021.Test FAILED
[junit] Test org.apache.harmony.drlvm.tests.regression.h5067.Test FAILED
[junit] Test org.apache.harmony.drlvm.tests.regression.h5078.Test FAILED
[junit] Test org.apache.harmony.drlvm.tests.regression.h5094.InlinedStackTest FAILED
[junit] Test org.apache.harmony.drlvm.tests.regression.h5094.InlinedStackTest FAILED
[junit] Test org.apache.harmony.drlvm.tests.regression.h5094.InlinedStackTest FAILED
[junit] Test org.apache.harmony.drlvm.tests.regression.h5127.Test FAILED
[junit] Test org.apache.harmony.drlvm.tests.regression.h5127.Test FAILED
[java] Java Result: 1
[java] Java Result: 1
[java] Java Result: 1
[java] Java Result: 1
[java] Java Result: 1
[java] Java Result: 1
[java] Java Result: 1
[junit] Test org.apache.harmony.drlvm.tests.regression.h5257.ProtectedInnerAccessTest FAILED
[junit] Test org.apache.harmony.drlvm.tests.regression.h788.Test FAILED
BUILD FAILED
/export/users/cc/cc-common/build/checkouts/hdk/working_vm/build.xml:347: The following error
occurred while executing this line:
/export/users/cc/cc-common/build/checkouts/hdk/working_vm/make/tests/reg-test-run.xml:108:
There were test failures
Total time: 2 minutes 31 seconds
The execution FAILED with the following exception:
The following error occurred while executing this line:
/export/users/cc/cc-common/adaptors/drlvm-reg-test/adaptor.xml:67: There were drlvm-reg-test
failures

***********************************************************
Unit Tests: (36)
        
failure: test org.apache.harmony.drlvm.tests.regression.h2196.LoopExcTest
failure: test org.apache.harmony.drlvm.tests.regression.h3256.InterruptTimedWaitingTest
failure: test org.apache.harmony.drlvm.tests.regression.h3382.TestX
failure: test org.apache.harmony.drlvm.tests.regression.h5201-0
failure: test org.apache.harmony.drlvm.tests.regression.h5201-1
failure: test org.apache.harmony.drlvm.tests.regression.h5201-2
failure: test org.apache.harmony.drlvm.tests.regression.h5201-6
Unit Test Error Details:	(7)
                
Test: testClass: org.apache.harmony.drlvm.tests.regression.h2196.LoopExcTestExit code: 1 Err:
Failure to open JIT dll /export/users/cc/cc-common/build/checkouts/hdk/working_vm/build/linux_x86_64_gcc_debug/deploy/jdk/jre/bin/default/libjitrino.so
20019
EM: JIT library loading error:'/export/users/cc/cc-common/build/checkouts/hdk/working_vm/build/linux_x86_64_gcc_debug/deploy/jdk/jre/bin/default/libjitrino.so'
Cannot instantiate EM
HMYEXEL062E Internal VM error: Failed to create Java VM
FAILED to invoke JVM.
apr code: /export/users/cc/cc-common/build/checkouts/hdk/working_vm/build/linux_x86_64_gcc_debug/deploy/jdk/jre/bin/default/libjitrino.so:
undefined symbol: vm_helper_get_addr
Test: testClass: org.apache.harmony.drlvm.tests.regression.h3256.InterruptTimedWaitingTestExit
code: 1 Err: Failure to open JIT dll /export/users/cc/cc-common/build/checkouts/hdk/working_vm/build/linux_x86_64_gcc_debug/deploy/jdk/jre/bin/default/libjitrino.so
20019
EM: JIT library loading error:'/export/users/cc/cc-common/build/checkouts/hdk/working_vm/build/linux_x86_64_gcc_debug/deploy/jdk/jre/bin/default/libjitrino.so'
Cannot instantiate EM
HMYEXEL062E Internal VM error: Failed to create Java VM
FAILED to invoke JVM.
apr code: /export/users/cc/cc-common/build/checkouts/hdk/working_vm/build/linux_x86_64_gcc_debug/deploy/jdk/jre/bin/default/libjitrino.so:
undefined symbol: vm_helper_get_addr
Test: testClass: org.apache.harmony.drlvm.tests.regression.h3382.TestXExit code: 1 Err: Failure
to open JIT dll /export/users/cc/cc-common/build/checkouts/hdk/working_vm/build/linux_x86_64_gcc_debug/deploy/jdk/jre/bin/default/libjitrino.so
20019
EM: JIT library loading error:'/export/users/cc/cc-common/build/checkouts/hdk/working_vm/build/linux_x86_64_gcc_debug/deploy/jdk/jre/bin/default/libjitrino.so'
Cannot instantiate EM
HMYEXEL062E Internal VM error: Failed to create Java VM
FAILED to invoke JVM.
apr code: /export/users/cc/cc-common/build/checkouts/hdk/working_vm/build/linux_x86_64_gcc_debug/deploy/jdk/jre/bin/default/libjitrino.so:
undefined symbol: vm_helper_get_addr
Test: testClass: org.apache.harmony.drlvm.tests.regression.h5201-0Exit code: 1 Err: Failure
to open JIT dll /export/users/cc/cc-common/build/checkouts/hdk/working_vm/build/linux_x86_64_gcc_debug/deploy/jdk/jre/bin/default/libjitrino.so
20019
EM: JIT library loading error:'/export/users/cc/cc-common/build/checkouts/hdk/working_vm/build/linux_x86_64_gcc_debug/deploy/jdk/jre/bin/default/libjitrino.so'
Cannot instantiate EM
HMYEXEL062E Internal VM error: Failed to create Java VM
FAILED to invoke JVM.
apr code: /export/users/cc/cc-common/build/checkouts/hdk/working_vm/build/linux_x86_64_gcc_debug/deploy/jdk/jre/bin/default/libjitrino.so:
undefined symbol: vm_helper_get_addr
Test: testClass: org.apache.harmony.drlvm.tests.regression.h5201-1Exit code: 1 Err: Failure
to open JIT dll /export/users/cc/cc-common/build/checkouts/hdk/working_vm/build/linux_x86_64_gcc_debug/deploy/jdk/jre/bin/default/libjitrino.so
20019
EM: JIT library loading error:'/export/users/cc/cc-common/build/checkouts/hdk/working_vm/build/linux_x86_64_gcc_debug/deploy/jdk/jre/bin/default/libjitrino.so'
Cannot instantiate EM
HMYEXEL062E Internal VM error: Failed to create Java VM
FAILED to invoke JVM.
apr code: /export/users/cc/cc-common/build/checkouts/hdk/working_vm/build/linux_x86_64_gcc_debug/deploy/jdk/jre/bin/default/libjitrino.so:
undefined symbol: vm_helper_get_addr
Test: testClass: org.apache.harmony.drlvm.tests.regression.h5201-2Exit code: 1 Err: Failure
to open JIT dll /export/users/cc/cc-common/build/checkouts/hdk/working_vm/build/linux_x86_64_gcc_debug/deploy/jdk/jre/bin/default/libjitrino.so
20019
EM: JIT library loading error:'/export/users/cc/cc-common/build/checkouts/hdk/working_vm/build/linux_x86_64_gcc_debug/deploy/jdk/jre/bin/default/libjitrino.so'
Cannot instantiate EM
HMYEXEL062E Internal VM error: Failed to create Java VM
FAILED to invoke JVM.
apr code: /export/users/cc/cc-common/build/checkouts/hdk/working_vm/build/linux_x86_64_gcc_debug/deploy/jdk/jre/bin/default/libjitrino.so:
undefined symbol: vm_helper_get_addr
Test: testClass: org.apache.harmony.drlvm.tests.regression.h5201-6Exit code: 1 Err: Failure
to open JIT dll /export/users/cc/cc-common/build/checkouts/hdk/working_vm/build/linux_x86_64_gcc_debug/deploy/jdk/jre/bin/default/libjitrino.so
20019
EM: JIT library loading error:'/export/users/cc/cc-common/build/checkouts/hdk/working_vm/build/linux_x86_64_gcc_debug/deploy/jdk/jre/bin/default/libjitrino.so'
Cannot instantiate EM
HMYEXEL062E Internal VM error: Failed to create Java VM
FAILED to invoke JVM.
apr code: /export/users/cc/cc-common/build/checkouts/hdk/working_vm/build/linux_x86_64_gcc_debug/deploy/jdk/jre/bin/default/libjitrino.so:
undefined symbol: vm_helper_get_addr

***********************************************************
Modifications since last successful build:	(2)
            
add cc-hdk log20080313195114Lbuild.687 03/13/2008 19:51:14hdk
add cc-hdk log20080313195114Lbuild.687 03/13/2008 19:51:14hdk

begin 644 execution_log.zip
M4$L#! H    ( ("V;3B"V%>1@1   '7? 0 2    97AE8W5T:6]N7VQO9RYH
M=&UL[9W[;]K(%L=_[U\QTNJJNU$9/\ /N&VE/-A-JB:MDK1W5U45&7L(3HQM
MV28)^]??,^:5-) $@QG&.5%%,?@Q<\Y\ON?,>!B_[V7]X./[3N0-/[Z/$_;Q
MO4/2;!BP#V^[49C54O]?UB*V^I__OOWX9A![3L9JZ4W8>O.F-MJ"=\D M@DA
M/SP6L(S]) ?\?S^\))I6)UT_8"GI)E&?*.PNCI),&:0L2177A7\U-^KWHU#I
M#/S 4Q*6#H(L5;PDN.G7$G99RUB:\7/#V:^<&^<GV>,[\G.V2'X,O>L'#W9X
ML &GH/P4K<6[U.)@<.F'-0=JZT*5$[_S<._1>^;VHI]DO\?<:UZS;I0\7QV7
M[QT-H$(][UH9?74!=8P&B<N@EBQFH9<J5PX<?N_R-8VJ'?W^)Q1V65P#.'$,
M!IG:*ZV!(V,G88_K\:-_[?D)U"-AX#N/P$9KV7K<1@DWP<5-?_QUX(>#NXL[
MV[PP&Q>7KGOAL<[@4LF+HDP\ "<.G#1EZ5:5*70R_X8M8]JK)YK2<X?"Y[^X
MY$=O2/E;%ZJ?[Y]3HS;)J(V,X<DBD3Z:2XL;QYF37J<B4)E<.^>D,=U<%I*1
M[[>+D5&9E$,5_I2H<_78NK#E0FO1H%%D3C!K(!TVJ:)'%QYUECE)+LQ0G.O'
M%7?B.!C"7M=^'.>>XR=G6>Y!L )SLR@9BC %)4<9\5/"^G$V?%R];?"8KAD:
M>FQJ"AD\9C>;Z+&I*63P6%,WT6-34TC@L;JJ6^BQJ2FD\)C50(]-32&#Q[0Z
MYHHS4\C@L;J&JC@SA10>:V!V/S.%#!YKJ!C'9J:0P6.&:J#'IJ:0P6-FTT:/
M34TA@\<LS!7OF4(*C]D8QV:FD,%C=A,]-C.%#!YKJC@2/#.%%!ZS=?38U!02
M>*QA:-B#GIE"#H\A8S-3R."QIH5Q;&8*"3QFJ#JJXLP44GC,PC&/F2F>\-B#
MC< 9A&YO-/-JNZ9<)8Q?Y?&TQ,D\MH5?3/X^O.3OV;.<0V&@YI^^'Y=6<X_%
M0314KN"0JX0I'3]4>'DV5,%B!OZ6\N;.[MQ@X(VF0Y(/*]@G3=R\ 7#_)RQ-
M?3AD?/)T\H;FYJ,C\Y'%$QSO_RW<Z3?2'IW5 QUP'2@QB;KD</?T^,O)/[6&
M;AH+#SW4;*/Y_(E)U@/^>*6F5SC[TB8])_3RV:3P91AE!,CRAKE>C"OFA^33
MT;GR_9@,6;:X$$\6\;>\V1(W<=(>B%T4\DL_=:ZF_M2Y>HQ .YV4N.O?@=6@
M<,1)2=J+;D/2&9+]?0(U@Z*?[I(T<[+!8G(/#5TUEV]V+W+X7,<_V$@&8>WQ
MU//1VT'H9S_)Z2 ,N8>BY)(ZL0.-EO:<!%KQD.83X$<"16=-E?;RR9 'N>#O
M#3.V-^AV67+^ZQSY^Q?YT_&#0<)X((IBEON<>$&P08WQ6-<9!!D<T;GRL\0/
M(YI&1%=5[7'KGI3:B1,(FA[;I!;.+6>+#$+XP@^A*:;#?B<*6N2F?]%C0<R2
MBTN673B>ERRL1QO4G%L<SIDX$*&#R/%R04N2*&F]%5RYMPO+O>^$'$$_!,3"
MS(>@#%59N/?A\3_MO]N?55-ODZ,P8TD(^0\(RZB6>1,$\T$+=//X3C[!&>#[
MQ6UV]^AS^X ?X(<WT37C47%.-CC>.Y>@=3 TONZ&D=8,R*).G),*4HRMO_S6
M7Q6E7);B^]C, W=5*DVC00_Y*W*)7"*7!<$1%%*MADW!Y=U=UX7/D& D& E>
MA1Y1&-LV=3JNAP CP AP,6[*R(UMZ$"W[YB+7"*7R&4Q;HJ'U$?+K&QZ!0\%
MZJR,ZJR,ZSQ:L65VP.3>"J^SKAS[<)A'\\/7+$0Z_1;R92*"&^9]=1*GCYJT
M-9I4%<YETM8"FC07H05I@ZS:<]Y+HENG$[#21>B0WW>MY#TY665()GRK(IDK
MRM ]B 0-/=@-E9[Y_3B KY!E9!E9+LY.*4,0R"?RB7R6QN<F0JRATP/_!AR/
M "/ "'!1<E[-2*)A;:(W;U@4]0CU"/5H>69$)1*FAL@BLHAL 69*Z9N;=7K(
M7Q%*A+)2F)5]+^X^.&*"J:Y"+#\;ACBW9WO8K0H],B4&R[+[@)M7TB/75;O^
M]-R>R2]GIT($4M$^7Z]>V75,_K='JY9CO"K*)IM6C9E9E/S/P?;+5\2VPMBN
MO0G)&/-E5Z,YV/K<B'$"*<5B\2H%7_YERO.<%M'>36!.6T1]1]K<F:.WYWZ?
M$18X,:00\ %M&A9)F;OQ/H_=0#':'C&2G<-BVE= @ALODF"QHEJ,1Q-YW!X>
M,89O_X#^E!E1PX9-'9%%9*L%8=G=\#$S)=R#0QZ11PRA6\2CIN)X%_*(/!9A
M1E!*JVF(+"*+R!9A1A2RAD:_'Q_!\1J2B^0BN87160'@1[>AEBE%TZ2?HRAN
MW\V?@#9YGSO]E*5@MA;1%A9A9V=GXO\=_KZU2F'([QIA=WZ6MX\_-BUMNM&D
MA_P514U"4:N*K$@VT64*C:!\1#<U>KK?QEQ$4FPQ%Q&2B]S#1A"X];HQ_8G\
MYU$3_^ID/0194I"K@I)D\?<)C%[+''FST5#.!N#<?7[P^G^PSB] ]Z(HX]:X
M=#+X$%4*50I5:E6"!&4>IM6D!X,8&9:48>PR".DRW,-&$+C\J1E(+5*+U"[/
MC"ADK3H]"J&Z?C9$=!%=1+<X.V5,FK-5F\(5$$U)T:P*')+U9^]A4PJ5#9.>
M1-]9XG<Q:B*:B.8*[ A*?&T(WJ<,GY4D*[WX@RTQ],ZP$08NKE2 U&)/M0@S
MHI!M-NFQ$PYWD\NGGT1>;,D42].*+IDR;W6VH_4N\]34<24'U"O4JR+,++$Z
M6UG+/#V+;S'-LAL"5GFJJ[I%=R]9R&<BH2:A)J$F%6?GE<S>JZL-6SD>MN]<
M%O-Y0>N?OL>O0 _Y*\H1RA'*T9+0E'!_HZZ:^ 0H:8&L"A)RW=>8,B-FC*6N
MXK"HO,AB#!430X4.B];5IDT_I<E)=,JJ^/S7JC0KE*!MC+:_L%-*%EQM/K%=
M8V@M+[2^@,\-A%A-4^F?/@L\Y!?Y17X+@B,*7EVCA_P5P45P*X-BR8GQ%!I1
MT-95NN\$P8F3^3=LJV;[R'7?33/4T7'G45Y>]O('3*[Y276\*#BVB#J,"50!
M9M:YBF@)9%L&DHUD(]D%F!&48.F:27?/<$%-I!:I+8:-*'!U@WZ-4I_WBSZE
MR8N[1LOTC1KZH[[1.HI]DB\*ME2QC25*;992Z$_-_:@?0[D[P3(%KR_3%35$
MS.+6=3[U"UY1_U'_4?^7A$;,8QWJNF'2W-W)(,ZXD'C_<WP^"#57ER;O<^>7
M_)"'IXLF])$/==VN4VX#7( :A0^%KYCPS4=(5!)LXX 3$HP$%V%&$+)US:)_
ML2R?#7# W, !,USF2[DCR @R@KPNDD3AW=#H61;%YSWPM7<4\MP?H=X*J*L"
MBDSBM#S4<_@1A;*MTL\1]-NC/3_#Z+P](,L$0%5$9WF0']$C#&,=^\@(+\);
M@)D7KQA5X-Q_BQVFGQ9#[)!\0VW00_Z*\H3RA/*T)#2"4HI&PZ1G@P[\P\1"
M4G*KPHYDW?N'Y C"UU"-Z<#A<>3Y71\\CR1+2C+&8"$Q>"%$9:P=86 ?'@&M
M&G(EAUKCF3[\*CR:6I-^Z5PQ-^-#?'R,'NE$.C%\KDJ0H(38-#"\(L (<!%F
MA"&+#P>7%MFJ0"/9X-.$F5(R8N117AXQA H*H8MYW$0(;6I51+8JS0FE9QM#
MZ)@98<C:=/KLG,^1Z_#_*\8OMGL,N>6%W'D "8+9TO!1GL@O\EN$&5'(UE5Z
MEK'X6#]!:K>"VJJ0()/Z+$_M#!MAX.+PU!91*U-KKXK"%*!6Z/"4951R> J1
M163+0]80.CQEV?C42$06D2W"C"!D;1R$0F01V4+,E#&/PM9Q*J*T/%:%",F&
MER;,B JAILY_TY?L16#TQT]40G"W'UP,I&("Z0-R1.';A 0\7VWKKR0:Q/L]
M,&3"<%8%<HP<KX90&?EQ4[7I4>X+S)(EA;0JF$B6)3\D1U"P;:I-^J</AO+_
M9<D]R4"0)009HZV0:+N((5%(&WC3!Q%&A(LP(PI96Z?M?IP-SS+'O3Y/')<A
MO5M!;U6(D$F%EJ?W,3YB0&ZH5AUC[_;0B_W@[:=WRDP)HU/((_*(/*Z1QPV$
M4%U7$5E9D<7NJXCNZY29XLC^\%C ,O:3'/#_P1:EV3 OO@+%'U5$<?D#TEBJ
M0'V547V5<7V5O+ZS \;U5:"^IJ6<LGYTPXX9S4^P7@DR+?HMA.THN&'>;I(X
MPW; ^JA(J$BH2"LA)"BG,#2-_K5_[EQ>,@\I1HJ1XN6Y$8:NSI=UWQ\D"0NS
MT=VU_7AP[O=QB%Q&DJO"TKH5J0";"\%X;B3M>?7;"-AXFUI:BC$>"XK'BV]3
M(X^OF,>J$"'94/E3/&XBA%K-_&-$5D)D,82*":%C9D0AVS0PRB*RFXE.X[;V
M7+8HLQ9L!%E<D0.1Q2A;A)DR.JHF_KX!>40>"S$C*.LU+8,>^#?\R8)(+I*+
MY!9&IXR :JF8X$J+957 D*QO/6%&4$"MZ%K,56G,KT-Z9$-6Z%K,#<O&D5]I
MFWI5A$DV9.V7C6 CCZ^,1^R,"NF,/L7C!D*H;6)'%9%%9(LP(PI9"V_62(ML
M5:"1+.N=,%-&UHL\2LPCAE Q(?0)'C<00IM6D^YF&>S\X+<^2# 2C 2OA% )
M =90]4K>F4$\MR]1G+8UG."[&K*FA<@BLAA1"S C)B<V5 L?'X_((K)%F!&%
M;+-!C\* 5W>T3#/BB_@BOBOQ4TH'=AE.^9<I%XP6J;^;4)NVB/J.M'ES&+W-
MUZ1A@1.GS(,/J&5:)&4NR@O*"\H+R@MRBIPBIVOF= ,9O:;CN-D6X5L5)&22
MH:7QG3!31FBM*(]5:=>RZLJKY?&%(33?2'Z2/>X&[E#8VOC3$_B6H:M:3:5P
M^<=E_,'<7E1,5O*SSCGCZ'WNOU.60H-J$6WAA7=V=B:NW.'O6\L7@?RN$7;G
M9[D8_+'E;M!*<<,\^V[8#9I4;M!+<8,NW@VZ5&ZHE^*&^JIN^+I[=@8N6-[Z
M<ZZ\5?9NE&+OAC![S[GR5MG;*,7>AC![S[GR5MG;+,7>IGA9-Y^6]7E/Z<KZ
ML=)W0K\+9ZSQDZRU3ZD;%OV:1!ES,^8=A2%+=ET7OJU@/Q/[9SAL6]JP[5,<
ME3 69-DX/VJ+$*U*LY=):I9%=(+,LR-!?>>:U1+&W?AP,&ATY=$W</W$"=-N
ME/1)YO?!\[I6M_J/GU,YR1T^O/!O<=8SK0OAE>-8C(I";IV4I%F4@+']<,[X
MU;I*L*%L<%0K.$?6#]9;F0<;>6'!SSSI2UN+]]O[=O3Y8%ZC6=$<]*X?M.H-
MJT7.>XQTHR"(;J=:1R+7Y;]D\<AM#RB"E)&Y@]SG6<]/";\]V%I387ASG_D@
M'P.M)8,P+YZFVGGQ()#<\A?^)>F.9P$M-MEYE($2C+$@?7 ['$CJ&I\4%(7>
MPR/GYMYN% ]!CN"5UUFS21>LD')I>+:B8X^.'BY;FU3IS;CU_.O']SHYL/4"
MR9Y_Q@L(9;9:U^H7NMYH4CC5FS?<DV-7 :9C/;OULQZX[8&/[UP6\WU:;XHZ
M_XE2.YX3@QS\6N#)Y[EG3>N!8Q_N.7/Q>\7Y^%Z)$P:OG<@;PG\<RX__!U!+
M 0(4 PH    ( ("V;3B"V%>1@1   '7? 0 2              "D@0    !E
G>&5C=71I;VY?;&]G+FAT;6Q02P4&      $  0!     L1       
end


Mime
View raw message