harmony-alerts mailing list archives

Site index · List index
Message view « Date » · « Thread »
Top « Date » · « Thread »
From nom...@intel.com
Subject [build-test alert] FAILED Linux x86: drlvm-reg-test debug
Date Thu, 13 Mar 2008 13:51:09 GMT

BUILD FAILED:
	Ant Error Message:
/export/users/cc/cc-common/scripts/cc-exec-adaptor.xml:104: The following error occurred while
executing this line: /export/users/cc/cc-common/adaptors/drlvm-reg-test/adaptor.xml:67: There
were drlvm-reg-test failures

Date of build:	2008-03-13 19:47:34 +0600
Time to build:	3 minutes 27 seconds
Last changed:	03/13/2008 19:18:41
Last log entry:	hdk

***********************************************************
Errors/Warnings:	(130)
            
[junit] Test org.apache.harmony.drlvm.tests.regression.h0000.DirectByteBufferTest FAILED
[junit] Test org.apache.harmony.drlvm.tests.regression.h1578.NaNTest FAILED
[junit] Test org.apache.harmony.drlvm.tests.regression.h1654.H1654Test FAILED
[junit] Test org.apache.harmony.drlvm.tests.regression.h1748.IntfAccessTest FAILED
[junit] Test org.apache.harmony.drlvm.tests.regression.h1788.abcdTest FAILED
[junit] Test org.apache.harmony.drlvm.tests.regression.h1800.ExecTest FAILED
[junit] Test org.apache.harmony.drlvm.tests.regression.h1802.UnresolvedParamTest FAILED
[junit] Test org.apache.harmony.drlvm.tests.regression.h1802.UnresolvedHandlerTest FAILED
[junit] Test org.apache.harmony.drlvm.tests.regression.h1840.SimplestTest FAILED
[junit] Test org.apache.harmony.drlvm.tests.regression.h1840.SimplestTest FAILED
[junit] Test org.apache.harmony.drlvm.tests.regression.h1852.DivIntTest FAILED
[junit] Test org.apache.harmony.drlvm.tests.regression.h1857.Test FAILED
[junit] Test org.apache.harmony.drlvm.tests.regression.h1859.Test FAILED
[junit] Test org.apache.harmony.drlvm.tests.regression.h1859.Test FAILED
[junit] Test org.apache.harmony.drlvm.tests.regression.h1861.Test FAILED
[junit] Test org.apache.harmony.drlvm.tests.regression.h1863.H1863Test FAILED
[junit] Test org.apache.harmony.drlvm.tests.regression.h2057.SyncTest FAILED
[junit] Test org.apache.harmony.drlvm.tests.regression.h2083.Test FAILED
[junit] Test org.apache.harmony.drlvm.tests.regression.h2083.Test FAILED
[junit] Test org.apache.harmony.drlvm.tests.regression.h2084.Test FAILED
[junit] Test org.apache.harmony.drlvm.tests.regression.h2086.Test FAILED
[junit] Test org.apache.harmony.drlvm.tests.regression.h2092.Test FAILED
[junit] Test org.apache.harmony.drlvm.tests.regression.h2092.Test FAILED
[junit] Test org.apache.harmony.drlvm.tests.regression.h2103.Test FAILED
[junit] Test org.apache.harmony.drlvm.tests.regression.h2113.Test FAILED
[junit] Test org.apache.harmony.drlvm.tests.regression.h2151.VMInit1Test FAILED
[java] Java Result: 1
[junit] Test org.apache.harmony.drlvm.tests.regression.h2259.H2259 FAILED
[junit] Test org.apache.harmony.drlvm.tests.regression.h2261.RCETest FAILED
[junit] Test org.apache.harmony.drlvm.tests.regression.h2335.SimplestLibraryPathTest FAILED
[junit] Test org.apache.harmony.drlvm.tests.regression.h2644.BootDelegationTest FAILED
[junit] Test org.apache.harmony.drlvm.tests.regression.h2679.DupTest FAILED
[junit] Test org.apache.harmony.drlvm.tests.regression.h2748.Test FAILED
[junit] Test org.apache.harmony.drlvm.tests.regression.h2773.InfinityTest FAILED
[junit] Test org.apache.harmony.drlvm.tests.regression.h2808.finTest FAILED
[junit] Test org.apache.harmony.drlvm.tests.regression.h2846.NoVerifyTest FAILED
[junit] Test org.apache.harmony.drlvm.tests.regression.h2873.RemTest FAILED
[junit] Test org.apache.harmony.drlvm.tests.regression.h2874.Test FAILED
[junit] Test org.apache.harmony.drlvm.tests.regression.h2926.Test FAILED
[junit] Test org.apache.harmony.drlvm.tests.regression.h3027.AgentLibTest FAILED
[junit] Test org.apache.harmony.drlvm.tests.regression.h3048.H3048 FAILED
[junit] Test org.apache.harmony.drlvm.tests.regression.h3067.Test FAILED
[junit] Test org.apache.harmony.drlvm.tests.regression.h3074.Test FAILED
[junit] Test org.apache.harmony.drlvm.tests.regression.h3098.JsrNoRetTest FAILED
[junit] Test org.apache.harmony.drlvm.tests.regression.h3098.JsrNoRetTest FAILED
[junit] Test org.apache.harmony.drlvm.tests.regression.h3110.FieldTest FAILED
[junit] Test org.apache.harmony.drlvm.tests.regression.h3121.H3121 FAILED
[junit] Test org.apache.harmony.drlvm.tests.regression.h3150.Test FAILED
[junit] Test org.apache.harmony.drlvm.tests.regression.h3175.Test FAILED
[junit] Test org.apache.harmony.drlvm.tests.regression.h3216.ASETest FAILED
[junit] Test org.apache.harmony.drlvm.tests.regression.h3228.H3228 FAILED
[java] Java Result: 1
[junit] Test org.apache.harmony.drlvm.tests.regression.h3283.JavaLibraryPathTest FAILED
[junit] Test org.apache.harmony.drlvm.tests.regression.h3285.Test FAILED
[junit] Test org.apache.harmony.drlvm.tests.regression.h3317.GetFieldDeclaringClassTest FAILED
[junit] Test org.apache.harmony.drlvm.tests.regression.h3341.StopThreadInWait FAILED
[junit] Test org.apache.harmony.drlvm.tests.regression.h3380.LongToBitsTest FAILED
[junit] Test org.apache.harmony.drlvm.tests.regression.h3382.Test FAILED
[java] Java Result: 1
[junit] Test org.apache.harmony.drlvm.tests.regression.h3404.H3404 FAILED
[junit] Test org.apache.harmony.drlvm.tests.regression.h3446.SubSubTest FAILED
[junit] Test org.apache.harmony.drlvm.tests.regression.h3505.GetFieldModifiersTest FAILED
[junit] Test org.apache.harmony.drlvm.tests.regression.h3582.Test FAILED
[junit] Test org.apache.harmony.drlvm.tests.regression.h3619.ObjectLongWaitTest FAILED
[junit] Test org.apache.harmony.drlvm.tests.regression.h3652.Test FAILED
[junit] Test org.apache.harmony.drlvm.tests.regression.h3658.Test FAILED
[junit] Test org.apache.harmony.drlvm.tests.regression.h3658.Test FAILED
[junit] Test org.apache.harmony.drlvm.tests.regression.h3691.Test FAILED
[junit] Test org.apache.harmony.drlvm.tests.regression.h3698.ExceptionLocation FAILED
[junit] Test org.apache.harmony.drlvm.tests.regression.h3716.Test FAILED
[junit] Test org.apache.harmony.drlvm.tests.regression.h3730.StepM2N FAILED
[junit] Test org.apache.harmony.drlvm.tests.regression.h3738.Test FAILED
[junit] Test org.apache.harmony.drlvm.tests.regression.h3751.Test FAILED
[junit] Test org.apache.harmony.drlvm.tests.regression.h3784.Test FAILED
[junit] Test org.apache.harmony.drlvm.tests.regression.h3816.Test FAILED
[junit] Test org.apache.harmony.drlvm.tests.regression.h3822.Test FAILED
[junit] Test org.apache.harmony.drlvm.tests.regression.h3862.SubrBounds FAILED
[junit] Test org.apache.harmony.drlvm.tests.regression.h3894.ThreadGroupChildren FAILED
[junit] Test org.apache.harmony.drlvm.tests.regression.h3908.InvokeTest FAILED
[junit] Test org.apache.harmony.drlvm.tests.regression.h3909.FinalizerThreadGroup FAILED
[junit] Test org.apache.harmony.drlvm.tests.regression.h3954.Test FAILED
[junit] Test org.apache.harmony.drlvm.tests.regression.h3982.EmptyStackTrace FAILED
[junit] Test org.apache.harmony.drlvm.tests.regression.h4073.Test FAILED
[junit] Test org.apache.harmony.drlvm.tests.regression.h4073.Test FAILED
[junit] Test org.apache.harmony.drlvm.tests.regression.h4220.Test FAILED
[junit] Test org.apache.harmony.drlvm.tests.regression.h4265.Test FAILED
[junit] Test org.apache.harmony.drlvm.tests.regression.h4265.Test FAILED
[junit] Test org.apache.harmony.drlvm.tests.regression.h4267.UnresolvedArrayElem FAILED
[junit] Test org.apache.harmony.drlvm.tests.regression.h4292.Test FAILED
[junit] Test org.apache.harmony.drlvm.tests.regression.h4292.Test FAILED
[junit] Test org.apache.harmony.drlvm.tests.regression.h4511.GCTagged FAILED
[junit] Test org.apache.harmony.drlvm.tests.regression.h4512.GetCurrentThreadCpuTime FAILED
[junit] Test org.apache.harmony.drlvm.tests.regression.h4514.Test FAILED
[junit] Test org.apache.harmony.drlvm.tests.regression.h4514.Test FAILED
[junit] Test org.apache.harmony.drlvm.tests.regression.h4579.test FAILED
[junit] Test org.apache.harmony.drlvm.tests.regression.h4595.Test FAILED
[junit] Test org.apache.harmony.drlvm.tests.regression.h4596.Test FAILED
[junit] Test org.apache.harmony.drlvm.tests.regression.h4654.Test FAILED
[junit] Test org.apache.harmony.drlvm.tests.regression.h4675.DivLongTest FAILED
[junit] Test org.apache.harmony.drlvm.tests.regression.h4706.Test FAILED
[junit] Test org.apache.harmony.drlvm.tests.regression.h4751.Test FAILED
[junit] Test org.apache.harmony.drlvm.tests.regression.h4785.Test FAILED
[junit] Test org.apache.harmony.drlvm.tests.regression.h4785.Test FAILED
[junit] Test org.apache.harmony.drlvm.tests.regression.h4866.Test FAILED
[junit] Test org.apache.harmony.drlvm.tests.regression.h4874.Test FAILED
[junit] Test org.apache.harmony.drlvm.tests.regression.h4874.Test FAILED
[junit] Test org.apache.harmony.drlvm.tests.regression.h4979.AttachCurrentThread FAILED
[junit] Test org.apache.harmony.drlvm.tests.regression.h5021.Test FAILED
[junit] Test org.apache.harmony.drlvm.tests.regression.h5067.Test FAILED
[junit] Test org.apache.harmony.drlvm.tests.regression.h5078.Test FAILED
[junit] Test org.apache.harmony.drlvm.tests.regression.h5094.InlinedStackTest FAILED
[junit] Test org.apache.harmony.drlvm.tests.regression.h5094.InlinedStackTest FAILED
[junit] Test org.apache.harmony.drlvm.tests.regression.h5094.InlinedStackTest FAILED
[junit] Test org.apache.harmony.drlvm.tests.regression.h5127.Test FAILED
[junit] Test org.apache.harmony.drlvm.tests.regression.h5127.Test FAILED
[java] Java Result: 1
[java] Java Result: 1
[java] Java Result: 1
[java] Java Result: 1
[java] Java Result: 1
[java] Java Result: 1
[java] Java Result: 1
[junit] Test org.apache.harmony.drlvm.tests.regression.h5257.ProtectedInnerAccessTest FAILED
[junit] Test org.apache.harmony.drlvm.tests.regression.h788.Test FAILED
BUILD FAILED
/export/users/cc/cc-common/build/checkouts/hdk/working_vm/build.xml:347: The following error
occurred while executing this line:
/export/users/cc/cc-common/build/checkouts/hdk/working_vm/make/tests/reg-test-run.xml:108:
There were test failures
Total time: 3 minutes 23 seconds
The execution FAILED with the following exception:
The following error occurred while executing this line:
/export/users/cc/cc-common/adaptors/drlvm-reg-test/adaptor.xml:67: There were drlvm-reg-test
failures

***********************************************************
Unit Tests: (36)
        
failure: test org.apache.harmony.drlvm.tests.regression.h2196.LoopExcTest
failure: test org.apache.harmony.drlvm.tests.regression.h3256.InterruptTimedWaitingTest
failure: test org.apache.harmony.drlvm.tests.regression.h3382.TestX
failure: test org.apache.harmony.drlvm.tests.regression.h5201-0
failure: test org.apache.harmony.drlvm.tests.regression.h5201-1
failure: test org.apache.harmony.drlvm.tests.regression.h5201-2
failure: test org.apache.harmony.drlvm.tests.regression.h5201-6
Unit Test Error Details:	(7)
                
Test: testClass: org.apache.harmony.drlvm.tests.regression.h2196.LoopExcTestExit code: 1 Err:
Failure to open JIT dll /export/users/cc/cc-common/build/checkouts/hdk/working_vm/build/linux_x86_gcc_debug/deploy/jdk/jre/bin/default/libjitrino.so
20019
EM: JIT library loading error:'/export/users/cc/cc-common/build/checkouts/hdk/working_vm/build/linux_x86_gcc_debug/deploy/jdk/jre/bin/default/libjitrino.so'
Cannot instantiate EM
HMYEXEL062E Internal VM error: Failed to create Java VM
FAILED to invoke JVM.
apr code: /export/users/cc/cc-common/build/checkouts/hdk/working_vm/build/linux_x86_gcc_debug/deploy/jdk/jre/bin/default/libjitrino.so:
undefined symbol: vm_helper_get_addr
Test: testClass: org.apache.harmony.drlvm.tests.regression.h3256.InterruptTimedWaitingTestExit
code: 1 Err: Failure to open JIT dll /export/users/cc/cc-common/build/checkouts/hdk/working_vm/build/linux_x86_gcc_debug/deploy/jdk/jre/bin/default/libjitrino.so
20019
EM: JIT library loading error:'/export/users/cc/cc-common/build/checkouts/hdk/working_vm/build/linux_x86_gcc_debug/deploy/jdk/jre/bin/default/libjitrino.so'
Cannot instantiate EM
HMYEXEL062E Internal VM error: Failed to create Java VM
FAILED to invoke JVM.
apr code: /export/users/cc/cc-common/build/checkouts/hdk/working_vm/build/linux_x86_gcc_debug/deploy/jdk/jre/bin/default/libjitrino.so:
undefined symbol: vm_helper_get_addr
Test: testClass: org.apache.harmony.drlvm.tests.regression.h3382.TestXExit code: 1 Err: Failure
to open JIT dll /export/users/cc/cc-common/build/checkouts/hdk/working_vm/build/linux_x86_gcc_debug/deploy/jdk/jre/bin/default/libjitrino.so
20019
EM: JIT library loading error:'/export/users/cc/cc-common/build/checkouts/hdk/working_vm/build/linux_x86_gcc_debug/deploy/jdk/jre/bin/default/libjitrino.so'
Cannot instantiate EM
HMYEXEL062E Internal VM error: Failed to create Java VM
FAILED to invoke JVM.
apr code: /export/users/cc/cc-common/build/checkouts/hdk/working_vm/build/linux_x86_gcc_debug/deploy/jdk/jre/bin/default/libjitrino.so:
undefined symbol: vm_helper_get_addr
Test: testClass: org.apache.harmony.drlvm.tests.regression.h5201-0Exit code: 1 Err: Failure
to open JIT dll /export/users/cc/cc-common/build/checkouts/hdk/working_vm/build/linux_x86_gcc_debug/deploy/jdk/jre/bin/default/libjitrino.so
20019
EM: JIT library loading error:'/export/users/cc/cc-common/build/checkouts/hdk/working_vm/build/linux_x86_gcc_debug/deploy/jdk/jre/bin/default/libjitrino.so'
Cannot instantiate EM
HMYEXEL062E Internal VM error: Failed to create Java VM
FAILED to invoke JVM.
apr code: /export/users/cc/cc-common/build/checkouts/hdk/working_vm/build/linux_x86_gcc_debug/deploy/jdk/jre/bin/default/libjitrino.so:
undefined symbol: vm_helper_get_addr
Test: testClass: org.apache.harmony.drlvm.tests.regression.h5201-1Exit code: 1 Err: Failure
to open JIT dll /export/users/cc/cc-common/build/checkouts/hdk/working_vm/build/linux_x86_gcc_debug/deploy/jdk/jre/bin/default/libjitrino.so
20019
EM: JIT library loading error:'/export/users/cc/cc-common/build/checkouts/hdk/working_vm/build/linux_x86_gcc_debug/deploy/jdk/jre/bin/default/libjitrino.so'
Cannot instantiate EM
HMYEXEL062E Internal VM error: Failed to create Java VM
FAILED to invoke JVM.
apr code: /export/users/cc/cc-common/build/checkouts/hdk/working_vm/build/linux_x86_gcc_debug/deploy/jdk/jre/bin/default/libjitrino.so:
undefined symbol: vm_helper_get_addr
Test: testClass: org.apache.harmony.drlvm.tests.regression.h5201-2Exit code: 1 Err: Failure
to open JIT dll /export/users/cc/cc-common/build/checkouts/hdk/working_vm/build/linux_x86_gcc_debug/deploy/jdk/jre/bin/default/libjitrino.so
20019
EM: JIT library loading error:'/export/users/cc/cc-common/build/checkouts/hdk/working_vm/build/linux_x86_gcc_debug/deploy/jdk/jre/bin/default/libjitrino.so'
Cannot instantiate EM
HMYEXEL062E Internal VM error: Failed to create Java VM
FAILED to invoke JVM.
apr code: /export/users/cc/cc-common/build/checkouts/hdk/working_vm/build/linux_x86_gcc_debug/deploy/jdk/jre/bin/default/libjitrino.so:
undefined symbol: vm_helper_get_addr
Test: testClass: org.apache.harmony.drlvm.tests.regression.h5201-6Exit code: 1 Err: Failure
to open JIT dll /export/users/cc/cc-common/build/checkouts/hdk/working_vm/build/linux_x86_gcc_debug/deploy/jdk/jre/bin/default/libjitrino.so
20019
EM: JIT library loading error:'/export/users/cc/cc-common/build/checkouts/hdk/working_vm/build/linux_x86_gcc_debug/deploy/jdk/jre/bin/default/libjitrino.so'
Cannot instantiate EM
HMYEXEL062E Internal VM error: Failed to create Java VM
FAILED to invoke JVM.
apr code: /export/users/cc/cc-common/build/checkouts/hdk/working_vm/build/linux_x86_gcc_debug/deploy/jdk/jre/bin/default/libjitrino.so:
undefined symbol: vm_helper_get_addr

***********************************************************
Modifications since last successful build:	(2)
            
add cc-hdk log20080313191841Lbuild.726 03/13/2008 19:18:41hdk
add cc-hdk log20080313191841Lbuild.726 03/13/2008 19:18:41hdk

begin 644 execution_log.zip
M4$L#! H    ( &&>;3B59Z.F'1   (SO 0 2    97AE8W5T:6]N7VQO9RYH
M=&UL[9U];YO(%H?_[Z= 6EUU;U0/+S9OOFVEO.TF5=.MDK1WKZHJPC"):3 @
MP$F\G_[.@)TFC9T8QWB _*S( 0/#G'/F.7-F&&;>#K-1\/[M(/(F[]_&"7W_
MUI'2;!+0=Z_/HS#KI/X_M"]9RK_^\_K]JW'L.1GMI%=A_]6K3K''MI(QVY<D
MZ9M' YK1[](>_^^'%Y*J&M*Y']!4.D^BD233FSA*,GF<TB2579?]==QH-(I"
M>3#V T].:#H.LE3VDN!JU$GH12>C:<;39JG_<*Z<[](./Y&GV9?R:\C-*+AW
MPKT=E@3A2?07G]*)@_&%'W8<)JW+1$[\P?VSBVWJ#J/OTNZ0NI=<LO,H>5H<
MEY\=C9E 0^]2+@Z=,1FC<>)2)B6-:>BE\@^'77[G]AV5* /M[B^$G;)8 I9P
MS!1RJZ^TPPP9.PE]*,>WT:7G)TR.A#+;>1+;Z9>5XSI*N K.KD;3PX$?CF_.
M;BSC[,)USSPZ&%_(>3[DF?I9JH&3IC2M3X9")_.O:!FE_GBD$#UU*?O]%V-\
M&TX(WW29[/GY.2^*+16E8XI-%@FSSEQ(W#C.G/0R%4'([-XY'KW;W;)L%(:O
M$1I%AN0#A7WD:/#CH6K9GLO*B<J*0^8$/XO&@,[D\\C"JTXR)\F=,<O+Y4.I
MG3@.)NRL2S^.<[/QQ&F6FX^I@+I9E$PVK@<B'6:2GTIT%&>3A[()MY6FZBIL
M5>BA]K:R;!NV*O10>UO9F@%;%7JHNZVZBF;"5H4>ZF\KLP=;%7JHO:W4+N+ 
MJ1YJ;ZNN"A\XU4/];=5#S#[50^UMU5-07TWU4'M;Z8H.6Q5ZJ+VM#-N"K0H]
MU-Y6)N+ F1[J;RL+]=54#[6WE67#5E,]U-Y6MH*^VZD>ZF\K2X.M"CW4W58]
M745;>*J'!M@*7$WU4'M;V2;JJZD>ZFXK7='@ Z=ZJ+^M3/1;3/7PB*WN[03.
M.'2'Q:BG&@UW2BB_Q<.1@+,!9 L/S#[OEOD\F<HIRPP3^\/7HVK$]F@<1!/Y
M!SO_1T+E@1_*/#,;DFXU[7Y)>2FG-VXP]HH1B-*[9R@G3=S<^MSX"4U3GUTR
M33R=;9!<=X3I3EH\IO#N9^%)OQ5##QGU";M9'(4>%^;#X?%VP2O-'#]87.Q^
MDTZ'5&*6XVB%$8/<OV'E8\)P=U(I'4;7H3282+N[DA-Z1;)IYF3CQ2D>Z)IB
ME#?$4EJ8JXW[(Y_'8>?AR.=B<QSZV7?I>!R&7$51<D&<V&%F)$,G87:=D'S\
M=<$K^6D\,LR'YNWEGF]GDM&=\?DY34Y_':)]]R9_,*6/$\H]<A33D"GN5/*"
M8%/(>?3<&0<9.WWPP\\2/XQ(&DF:HJCVPBSO,X_ L\FN21SFWX/(R8L239(H
MZ;\6F?/7"S.]ZX2\T/HA*Y1AYC.7SN18>/;!T?_V_][_J!C:OG089C0)6=7Y
M]6@J8FXT5O:9S=R\=I ^L!38\<56WC[\N+_'+_##J^B2<K<Z)XJ8GNW$":/4
MHQMSO'-UV9?&(3O@ATS2=#(:1$%?NAJ=#6D0T^3L@F9GCN<E"X7@I7XMZ$R5
MMV&259T%$I^<3X 7\ +>,K3,X_6Y,!IZCQSP;^#XXG%L!6#E?$II'._Q(J@"
M-7L68?8^WW9=]AO ;1RXK0!-;#!0&MR'T(BBU[*(,W ]<-LX;A'_;C[^O8M+
M%0&PQ1K'^S?4!8[ $3B6PF7U"O3!?!T;G0I"9@++A<#R5.!BWH^?%\P>&G"!
M-?G(9Y=Y)+]\S<Y'(U]"/NM <$6]ST[BC."'&N>'6N$)&A;.+R!G08302']S
M.DRB:V<0T,H=SX$3>@$>I\'UP/4\AQU!'0I63R$G_B@.V"$@W#B$T8H1T(KY
M!9E*.A: ); $ENO&<A,5JJZ1/?^*61W<@EMP6Q*8E]$MJ)N;:*;K)H$/@@^"
M#UH:%6$Q@PU202I(71Z52AK=P! 8 L/G8KB)"M-002I(!:G+HU))A6ETR0'_
M!HM@$2R6XT5,U:DIK*E[,@DQ9!7( MERN+R$OFE-L;J/#UF=S>MPZWR8>]@_
M7:^/LKH([^&?X)^61V51>#^'UK\^@U;0V@Y>FC7Z<Q5:?2Y5G+#H8;$6*J&6
M'TQY2-.7U#<SAM.^I+R1]KEVB\U3?T0E&C@Q"QCZDD9,S9!2ZFZ\56/UX(.:
MYX,0,8B(&'I5=0BRM U@" R!X?*HB.H&M#60"E)!ZO*H5%)A D-@" Q%8Z@J
MZ,("AL"P!"J"XE95!:D@%:260$44J;I*OAX=LNM5  M@ 6Q98I[![8/G2&5R
M81OD8Q3%^S?SQXC-MG.+'].4J:TOJ0NSL+6U-3/^%M_N/R<STN^J1&_\+"\<
M_]ZT1]-TFQSP;_@R^#+XLN58$11]:(9*CG?W$7F 5M!:AA9!O':[^NWL+1^+
MPOW9R8;@%_R"W^?0\R(&K1N]GGPR9KK=Y1>O?RX5?@.R$T495\6%D[$?X9G@
MF>"95@1'4)!AF#;9&\= %^@"W3*T".*5+[L$6 $K8%T:%5&DFEUR&#)Q_6P"
M8D$LB"V-3!7CVBS%(NP.(!)$@L@RM%0"8\\@GZ*O-/'/44>"2!!9'AE!T:W%
MJNICBM7UZ@!M*T!HDN<I#^U/6H3QBMD :@%KD\IY*QS+"K NG@U@$Z3:-CER
MPLEV<I&N?382E2B:MNIL)/.F.3M<[\1)MH;9$N"FX*9*H%*#B9.>I'8U5Z7U
M5 $3)W45S23;%S3DPX;@B^"+X(M*(_,21MAUE9XE'TWV;UP:\T$\ZQ]BQ^] 
M#O@W7!!<$%S0<JQ4\)RBJQA8-Q <@L,2J(CI/>DJZ.<$J2"U#"JB2+4M\B%-
M/D7'%.N"@U@06QZ92D)=8 DL@>6ZL=Q A:JJ"OG#IX$';($ML"W'BRAF-94<
M\&_P"E[!ZW*LB&*UJY!=)P@^.9E_1:L8FM-==6A.@YZ:J;I27'<:Y9FERZ^I
MN.95VGA6T%<(WPO?NSPJZYR LP*@31U  ^A6(%KM&PFWJ B*I335(-LGF(L2
ML*+V+46+*%XUG7R.4I^W?#ZDR=*-GS*M'U-_T/I91[8_Y9-LE<JV7B+7MEE)
MKC_8N]$H9AD?!&5RWBV1<Q&KTC+9^# M]@VW#[</M[\<*V*6/>AJND%R6R?C
M../NP_NOX_/>I;G>:+:=6[[B11 >SYK0)1&ZFM4E7 >8LAG^;F/-N06%[JD!
M(HWUJQOAN'V=28VU-[Q/O;V/T,ZDKFJ2/VF6/\O?HV[@,&M<Y-.>MXW?%U#T
M6^&B&L;OXP")HKJGDI,LBD^'3$?>8<@#?+#<*);Q8$< RW.P$46PI9"/$6N3
M1SM^AKH8_*+3;Q5HA-&KM:[]VTAF6\%!DQS/"LQJY:9B6B'MO\5VN-]F0VSG
M>D_ID0/^#:_THB.)5OC$BKW2+2N" HA>SR GXP'[0QCQXH%%Z%\6&$'4ZHI^
MVQ=X%'G^N<\4#X !, !>G9TJ)FK0T3X'E^"R#"I58&BH-OEK\(.Z&>^UX[WM
M@!)0 LH5P1$4]1HZ*E-P"VY+H"*,5"R #5)!:@E4*@E[@6$3,6P%" U[.OP8
MAINH,&T5I#:/5%28 BK,*2K"2+7([7(R'R/7X?^!+; %MN6Y$<2PJ6(!2V +
M;$N@(HK4KD).,AH?:9\ *V %K,O2(HQ7]#@!5L!: A51I.KH<:H%J:TH_4UR
M-^5)U87V.)D65DNL!:EXFZ;N;]/,4!%$JH5^)9"*Z+<,*E4,>[ TC!,$AL"P
M!"JB*DQ#XR_3)3L1$_OA\D+@%;R"U\7 B*+69E%V/G/5GTDTCG>'3(L)Q2 (
MX M\5R*GBB#85BQRF!L"H3#8!)LE@1%4M=J*3?[PF;7]?VARQU. 7_ +?E="
M1Q3).I[:@%R06P(54:1:&MD?Q=GD)'/<R]/$<2F@!;2 MBPU8OCM*687-2V@
M!;3+HU)!AQ,P!(; \/D8;J#"U#0%I()4D+H\*J)(-=JWO"5(!:E5D&HL7MX2
M& )#8"@<P^4JS&\>#6A&OTM[_#]31#4*S/,NL[P74L@N7TF3IC(35BZ$E:?"
MRKFP/R^8"BMS84WYF(ZB*WI$29[ FMV.2;Z$;#\*KJBWG23.9#^@HS9YH59 
M E=:LS?V%I$C*HJW\3X"RCS"AQ*H5!+% T-@" R?B^$&*DQ=5<F?NZ?.Q07U
M0&NC:&T%+PV+=N_B(HQ8C2^JM3M.$AIFQ>C+W7A\ZH\PEDHTP*U 4FS,L *2
M"WEX*K1]VEELA&>,7JX%O"N4O,6#:>$5!%;KP+#!&(*6^@?!(E\BZ.FFG?\,
M4D$J2%T*%5&DVAC, 5)!:@E4A)&*Z11!*D@M@4H5STT-O,E>#PR;5();X3)*
M8V@(?9.]9Y@ZV?.O^%+M /;% ]L*!"NN-W\AIHKJTU00Q8)&5)\E4!%4?6))
MG$:2V@I6&M;>%+LD3L^TT(=;"U);P5Z3 H/RI%K5O1<+#($A,'PVAANH,"T#
MC=!:D-JD0MX*KU*:U!DJHD@U\;0%I(+4$JA4$=H"PYI@V(JBW21?LE8,-U!A
MVJ9-MK.,G7SO;1N "W ![BKD5%"=ZHJ&1RNUH!*/5FI.Y2TJ8JI373%,D-H\
M4M'^W'C[\Q854:2:%D@%J2!U>51$D6KWR&$8<'&+U7) ;=.H;04W38N$YV!3
M2>.T#)[\8,K]1%_JOIG!FO8EY8VTS]58;.83O=# B5/J]265J(HEI=2%5VF[
M5VF%GVA20-,.KP(\ZUCI(U07$*HOB><&PG950U<8J 6U)5"IHB(%AL 0&#X;
MPR4KS'PG^2[M<.%YD61[FUV!A^_IFJ)V%,+N_3"#WZ@[C%9S)7FJ<U(LMO,2
M>$Q39D;69E]XXZVMK5EAW.+;_?)9D'Y7)7KC9WD1_7>=;:!68H-YRMVP#=3F
MV$"KQ ::>!MHS;%!MQ(;=)]K@\_;)R=,_^55/^?.]5%VKQ)E]X0I>\Z=ZZ-L
MO1)EZ\*4/>?.]5&V48FR#?&NW'C<E<];U#$;Q?+("?USEF*')[+65J.FF^1S
M$F74S:AW&(8TV79==A0MR1JT)%O1.FM2<[AT2_(Q?"KHY#$MC&6J!9E-*M2M
M\")ER9R1\F07S\BYI)V$<KW<[^4I[EP<8?=/G# ]CY*1E/DCIDI-U;31PW6,
M9Y'"NR4_BV.<6UDD+AP'HLB*=.VD4II%"=.C'\[IF%I7#C81^!4BL02R4;!>
M2>[MY#EE1N;Q7=I??-[.E\./>_-*S#-U06Y&0;_;,_O2Z9!*YU$01->W+DZ*
M7)>_5^))UT/F!UAT2-UQ;O!LZ*<2?\377U-F>%G_:8.\9[.3C,,\>ZIBY=EC
ME<<U_^('I?/IN)W%*CN-,N;+"B:ZTHC9G%TH:5T^C"<*O?M7S@VSW2B>,(?*
MOKG,JB6=,RVDW+D]*>C4HL7*XYV92*^FI><?/[[3F&%[2SC ^2F>L1K,4KIJ
M]TRU>R9A2;UZQ2TY-15C=.J1K_ULR,QVS\8W+HWY.?U7JQK_D5P[GA,S7_!K
MAF>_YY8US'N&O7_F3Q._E9WW;^4XH>Q[$'D3]H]C^?[_4$L! A0#"@    @ 
M89YM.)5GHZ8=$   C.\! !(              *2!     &5X96-U=&EO;E]L
=;V<N:'1M;%!+!08      0 ! $    !-$      ! 
end


Mime
View raw message