harmony-alerts mailing list archives

Site index · List index
Message view « Date » · « Thread »
Top « Date » · « Thread »
From nom...@intel.com
Subject [build-test alert] FAILED Windows 2003 x86: jdktools-test debug
Date Mon, 10 Mar 2008 14:52:41 GMT

BUILD FAILED:
	Ant Error Message:
D:\cc\cc-common\scripts\cc-exec-adaptor.xml:104: The following error occurred while executing
this line: D:\cc\cc-common\adaptors\jdktools-test\adaptor.xml:24: The following error occurred
while executing this line: D:\cc\cc-common\build\checkouts\hdk\working_jdktools\build.xml:242:
The following error occurred while executing this line: D:\cc\cc-common\build\checkouts\hdk\working_jdktools\make\build-test.xml:97:
There were test errors.

Date of build:	2008-03-10 20:31:16 +0600
Time to build:	21 minutes 17 seconds
Last changed:	03/10/2008 15:20:23
Last log entry:	hdk

***********************************************************
Errors/Warnings:	(49)
            
Result: 1
[cc-ant]: Test Suite 'jdktools-test' execution. Repository updated: ${repository.updated}
[cc-ant]: Check for 'run' failure of hdk = ${hdk.parameters.run.failed}
[cc-ant]: Result: failed.superiors = '${failed.superiors}'
========================================
Testing jdktools binaries...
========================================
Compiling JPDA tests
Since fork is false, ignoring memoryMaximumSize setting
----------
1. WARNING in D:\cc\cc-common\build\checkouts\hdk\working_jdktools\modules\jpda\src\test\java\org\apache\harmony\jpda\tests\framework\TestOptions.java
(at line 505)
internalProperties.put(name, value);
^^^^^^^^^^^^^^^^^^^^^^^^^^^^^^^^^^^
Type safety: The method put(Object, Object) belongs to the raw type HashMap. References to
generic type HashMap<K,V> should be parameterized
----------
1 problem (1 warning)
JPDA exclude list: D:\cc\cc-common\build\checkouts\hdk\working_classlib\deploy\build\jdktools.jpda.exclude
Running JPDA tests
Debugger JVM=D:\cc\cc-common\build\checkouts\hdk\target\hdk\jdk\jre/bin/java
Debuggee JVM=D:\cc\cc-common\build\checkouts\hdk\target\hdk\jdk\jre/bin/java
SAMSA exclude list: D:\cc\cc-common\build\checkouts\hdk\working_classlib\deploy\build\jdktools.samsa.exclude
Running SAMSA tests
test.jre.home=D:\cc\cc-common\build\checkouts\hdk\target\hdk\jdk\jre
Run jdk/bin/java -version in D:\cc\cc-common\build\checkouts\hdk\working_jdktools\build\test_report
java version "1.5.0"
pre-alpha : not complete or compatible
svn = r635498, (Mar 10 2008), Windows/ia32/msvc 1310, debug build
http://harmony.apache.org
Run jdk/bin/javac -version in D:\cc\cc-common\build\checkouts\hdk\working_jdktools\build\test_report
Run jdk/bin/javah in D:\cc\cc-common\build\checkouts\hdk\working_jdktools\build\test_report
Run jdk/bin/javadoc in D:\cc\cc-common\build\checkouts\hdk\working_jdktools\build\test_report
Run jdk/bin/jarsigner in D:\cc\cc-common\build\checkouts\hdk\working_jdktools\build\test_report
Run jdk/bin/keytool -help in D:\cc\cc-common\build\checkouts\hdk\working_jdktools\build\test_report
Run jdk/bin/unpack200 in D:\cc\cc-common\build\checkouts\hdk\working_jdktools\build\test_report
Compiling TOOLS tests
Since fork is false, ignoring memoryMaximumSize setting
----------
1. WARNING in D:\cc\cc-common\build\checkouts\hdk\working_jdktools\modules\tools\src\test\java\org\apache\harmony\tests\tools\javah\Test\Test01.java
(at line 24)
private static final long xxx2 = 1;
^^^^
The field Test01.xxx2 is never read locally
----------
1 problem (1 warning)
TOOLS exclude list: D:\cc\cc-common\build\checkouts\hdk\working_classlib\deploy\build\jdktools.tools.exclude
Running TOOLS tests
test.jre.home=D:\cc\cc-common\build\checkouts\hdk\target\hdk\jdk\jre
The test report is in D:\cc\cc-common\build\checkouts\hdk\working_jdktools\build\test_report\html\index.html
The execution FAILED with the following exception:
The following error occurred while executing this line:
D:\cc\cc-common\adaptors\jdktools-test\adaptor.xml:24: The following error occurred while
executing this line:
D:\cc\cc-common\build\checkouts\hdk\working_jdktools\build.xml:242: The following error occurred
while executing this line:
D:\cc\cc-common\build\checkouts\hdk\working_jdktools\make\build-test.xml:97: There were test
errors.

***********************************************************
Unit Tests: (160)
        
error: testOwnedMonitors001 org.apache.harmony.jpda.tests.jdwp.ThreadReference.OwnedMonitorsTest
Unit Test Error Details:	(1)
                
Test: testOwnedMonitors001Class: org.apache.harmony.jpda.tests.jdwp.ThreadReference.OwnedMonitorsTestorg.apache.harmony.jpda.tests.framework.jdwp.exceptions.ReplyErrorCodeException:
Error 20: INVALID_OBJECT
	at org.apache.harmony.jpda.tests.framework.jdwp.VmMirror.checkReply(VmMirror.java:95)
	at org.apache.harmony.jpda.tests.framework.jdwp.VmMirror.getThreadName(VmMirror.java:699)
	at org.apache.harmony.jpda.tests.jdwp.ThreadReference.OwnedMonitorsTest.testOwnedMonitors001(OwnedMonitorsTest.java:114)
	at java.lang.reflect.VMReflection.invokeMethod(VMReflection.java)

***********************************************************
Modifications since last successful build:	(1)
            
add cc-hdk log20080310152023Lbuild.598 03/10/2008 15:20:23hdk

begin 644 execution_log.zip
M4$L#! H    ( )*F:CAP,T7;:0T  ,)-   2    97AE8W5T:6]N7VQO9RYH
M=&UL[1QK;]LX\K,#]#\,%CA< D2*7[$3KQL@U[3;=INVB+/=#W4O8"3:4B*+
M6DJRX^WUO]\,*=F6[-A.E^GE#F?LIA+%>7#>I"AVO604G'2OA3L]Z4:2GW09
MQ,DTX,__/A!A8L7^G[P#1]6__?SWDV<[:>2RA%OQ..P\VWFV8\4\22/KQKU-
MA AB:Q+KYJQ;N5VF!':61H'OX',7(BENN)- R$8<_!#\421D8L/'K/U21-8[
M/N8!]8RX3*;@\H$?^HDOPEA?(YJ!+^.$X,\Z?<?!_RQ'C$8B[,>.]*,D[F?0
M/H_MNU$ +'2!#1D17(:Y3OW [3L>=VY%BK">>]N?"'GKA\.K?$#]$;OE):PT
MP(3'"8X0Z/>9.Y[X CO/M_SM7"(P$H&<"%S[(9.$W;:WQT)L. %GH47,Q!:.
M(4H3)7Y'1%/K1G)KX =<:\3Q1L(MMV7=.OF(+.R3ZJ=J8*-;UY=?X(7D2HEX
MT_D^*>I.1.)*<M+\XQ&(:3#J5LNEI*478A3Y 4G_[<>S4\@@'HV9OA.P..8Y
MB1LV9LXB$_5V#6*12H>#T@LDXI%H]OR0B" <^#$,6!#S??"'H9#$QXB/A)R>
MLSM_E(YZ& D '9Z,M(C$FOV*[34;?C^]>/_F_2_?[VC:]/HW&%'ZL7346/J$
MOR_DL,\BA@CZ'I.(<:I[Z=$.),840M<GO_H0J8AA$V"11]AE":#0.1Q6#_>*
MSRI^F' 9LN#CW-/1F78I7.W#F 4IW_NY!/+/S;\BQ.4T0K&R 4^F';CT. H]
M\03&1B3TX9K"X#[H?_?@F@<B'"IS2+"G9!-("/PUB[US%MEPP0=<<E2IZC/D
M(9>^4^C3_77_TPG$GD@#%_%!Q$A0.$S4KKNE6BD:7P=\!+LUF# 9HL;VR+\P
M?2 Z;O$[)TA=7O(QY5G9(Y0X1LH'F80RW\"_[KL\"L0TZYL;BDVJMS/L6:Y9
MZ>D7:1BN\O/\.< 9OTZ'0R[A[:?SY]MPF# YY(FZO*'_)3_ T'TPM[4EW-P<
M[L\W*:;#^;C0*VSM%7;F%5HT:JCVC3N)[$^^3%(6G&,GM'O[$Y<Q.@>Y21$E
MM<1 21MJ^_"*^4$J,0M =1]>2BFDOKST,7?S@$4Q=SO0L@\;&+NX\]=1'=K5
M5L,4JEKUV!BJ^J$I5/6JN0$:D[K)\;76HVILBZIV:+>.VFMQU;?&5;4;[>83
M-*Q-UO 0:35J];6XFMOB:C3MX\9ZR3_$HX^?H,&W#ENF4&T*?JVMQ5ZW6^WU
MN!YB\#5C]EYM'QD3UK$YKEKKS?T!J!J'QARZT5X?_K9VPGK5KA\9LW>#6<>@
M/U<;QE18-5B"F#-W@]5,M6DN(IOS'(.R.MJ0OAXD*V/1W:2U;]#@0X)[\] 8
M6T=-<R-\DH9ET@G-I:]:VYRL#"95@U'&H 8-#M @5T\SY;2-U3(FN3)G5P9G
M7R:Y:IHS!H,^:++<-A=%:\96&ZHU<YG>H#L_R8"\88UGZZ6&.LYRZL8B@\FE
MIYHQKIH&US\,6KO!8M1D?66NDC&(:H/C'#[ W%L&@[M!N7^G8=6V=<*7O<MM
MWBU<>I(S=_8:ROXP";E[+A 'DB-^X-7IFW<OSW[$ZO+6J&H&56$8E[$"IV8P
M8K2,3E_-+>2:S$0&E_7-K=QM\O('B7W#JO=#<-6;ZZ6U_9N+MGW<>HH3C?_]
M,M6DK P-L&[7CPUQU=QH[__U$UB#%>\373,U9NWWH5E5FWS_QHK7(G!?CGF8
MQ&;V5AQO?*&T?09OVVU3U5/;W&H]<F7*X8T.<-/>@_]$S4\J;!A:6C"*RI@U
MM,SB,N4[B*EF*&@;BK*MA8C];"<1J>-9@PQ2;>SMS-NY0K+0RF<;?#N;]_#U
M3L][C[B)+V:C>&$7']%U1.@PE,M[@61]O4-:[XFE7=RA@! 'P%U(^%VR#ZZ@
MYZ%(/+5)=?,V0#T@U:/8@9KL&XG!7HSX=V[56R))>[MG^_? &NN==]^].?:>
M_=-(\(X[7^!492MXK;,5O&-IB/<2.K#K[,$+$4VE/_02J!T?HZG5J]4CM?\T
M ^N)03)!2X!7(@U=1OMG,0>"C]89^ X/8S2C?6"HATCMY[\.N%VDKP:9C_&G
MFHU6^A,4NZ"U62R(/(9,H=8 1Q\%/.%$B:Z1+.(MPL3C$)Z#;#4.F\='^[![
MSB3.013_>_OPNQ^Z8A(?^*Q1/QC%8P=JC1IZC$L[+T%)K(C.2Y*H<W"0Y_0L
MQ6.V7Z\]Y]'5]]()?/1O>$MBU'O#47E5N]U&;37LAHVCFBOQS3_.\4Y&)(>J
MTF;;AM,@ /48(PJ/N1QSUUX_+.^Q1O/V_1M+?5<"'F<N#D0[L=JBS!(A2[93
MO/LM9D/>656"99M_B7/[G+[H^"ST5N\OT%7!1GU;$I^LPSX#*38#6-=") H+
M&J('7?I[HGQDZ&-=!ZIUXJ.0:2,UCIJ'+H4B44:T^D=;N%T^8&F AJ]X)81K
M!8$\+?%#OWMX0M?\$2P)Z)(V3PJHR/8(G?X 9<:2Y*XON4,AVP\?PE8<<<<?
M^.ISGZ50L\22"UU-1\CIC*^<I8(%YHPYV0<>:$,%<MMQ.",&$\]WO&6L XR<
M](E%R!T>QTQ.-XW #]$SRF3>J,;L2XX%TQ.$%,FP-!$C#)H."X*-%#!^70L,
M,&6U8?BD D3E1XH .(/9Q&_!UQ:QJ1H!Q$#)=) B5_ '3I&T(A> MI-R3+6)
MDN?U%!CJB#EE2[C@,1HO%D_KXYPKG$>+=(C^C-#'*J7YE-%(ALCUE"?KV,)T
M,B3]/AICLJ<)>#R([%4AMC)GXFL6%;_!V],+52\"ZHV5-+4 0/;D#Z8K -=9
M3@95P1]D"%"QA-$E>%B&MV[Y-$97X]#-KZY4)*Q ()RL4-$&ES\O(5!MZJ.8
M.0:Z10RJ=0OHB"QWD7X<HSI<Q##C+F];YGX&O !702_VQVC;A& &"[L8.%Q_
M,,!2 P92C%;1W"LSJ*2'BM%A^8H<C BHKRRSL:V7,#Y5"E\-;_=>J>+;/L/2
M6071996JP%)1HQ)C'^<*S'755YLLR#+"$LD ?:0(@D/FDSR!X%TDXGBY'K0<
M+K' 41;D^G$4L"E0$\88^LHTAMT4>9GXF!=S$R7N<R[+TDMB!MW+WNG5;Q?O
M3@AGP:APWH4&P$81A5I/2#^9+L,3=8V#KJZ4VRQ:AFK(-8'=%MDM84-9W$VA
MZPGT:10A5G'QR==.EYS[Y)L2%3Y6E1UZ-7:"K),:(O7:!VX/;=W1UAUMC"F=
M6KW17$5+NP7]G>E]T2<*!'=?7UY^I%*]]^'%K[VR(#,U2AWE=88@=/.H3T@=
M.8T2,90LPKRI$./D(C<!>0]*!=S-^<M;%<ZRM\6KV7@0%_1])(Q8R(:4$N\)
M"W-*1>[F\6 -F^APIOBDK*"MG7R<);0(<#^U(J\SB+7,DK6:YW;19=<07&1X
M$68MQR/7/+\C*N.&6"[[P\+J09EB4<)%J'N87BH-T(8HPX-%B?NQRH/BW:\9
MR535!<5G.3M?K2[1QU"C8\6WQ19=!5!;5U]>J0]F3[[9M@W6VRY587FGM8R$
M8A)"AC4N<5)1MB'Y'Y7*+WHFR0M&@4_2V=K[ A )RI%!I?*"KHKI0O)Q'O$Q
MTB=IN>)!F8<8_1($UA=S%T\$QEV1>-I8L! O@[J<5C<PJUSPD1ASP)2'4P:5
MV%>'E8K%[TA5"/)2712&1_14!J8@'">N**?5BH43;,2,X#V.<Q'%*W76188O
M\PDXCK8,2;:&<)<>%K+*[G+;%;J !!00RQ53!M8G.2#X&W5!'1?XWG4\G*OO
M$28&+WH7*/,HF)9Q((].($(4U^S(".Q.G"NQK>BN2B*7M,K"8;&2*O?&:BM,
M'*7&CW1)LM02+/&JE+-<(U6LF <#C6!F>EBY8F-6@!6PJ) Q6\!$QI:PY55E
MD?]UI61E7CM_RBOG19I*R.M<ZS5I<9V#ZWCSM>3EI64J+"\ZE1*(MKI[:"^%
MMS3$B=QMO5I]K-"6K1_!G-!G"T,/1:)_@67I*/1<Q:<OU'AG4[_/]O#/+S"U
ML9(NHMM]1?4 *<8/M9\C^#[-F1<H6$H2>ZO6V+<YA^+RPX=WO<)!%$NG1!S^
M_XR(PAD1^F[C(1%ZI+JS6CA4)T2H/]7:VA,BZLWR 1'YG(T2!98, Y_F-W1&
M ]S=W=7A.=3*YT/ O;\51T/0FHG/ Q<RYA12M8A$Y3?MM%.SDR"/G8]T<H.V
MQ4=[ZZ/__LBW/DO.9?ZMSQ;;!^:C3Q.?KM1. BR\>A3TWPE:I.PQU/3:[0-;
M[]-JV753+WF/[?:&36U;<U6=?TSP5U]=ZK+.PD!E\5&43'5CMCBZT+3<0@N3
MEDX<>*^'HV]Q4)*%,45Y-?GO0+-5/QR5S(8<E;@!#40N:BR3]>F KKX?NOS.
MIDOB-_;PP9SA9SN8;Q=OM2"4?*1>#WVVLT-,4OY*56FKM[KHND2MS0I:^"5+
M14?D*B%V%,C" Y(_",=)I43?FWA4>&88\7%"A2+%23KCJS1TYK*(=@#/G%XQ
MES?3\5F=>E,??V.$WO:BSFC7?S1Q=8+8O!!0;!RW%1=85TSHC[(H;?0V*K5[
MP$ZZ!^J(M@-]7-N!.KOMWU!+ 0(4 PH    ( )*F:CAP,T7;:0T  ,)-   2
M              "D@0    !E>&5C=71I;VY?;&]G+FAT;6Q02P4&      $ 
, 0!     F0T      
end


Mime
View raw message