harmony-alerts mailing list archives

Site index · List index
Message view « Date » · « Thread »
Top « Date » · « Thread »
From nom...@intel.com
Subject [build-test alert] FAILED Linux x86_64: drlvm debug
Date Wed, 20 Feb 2008 02:43:56 GMT

BUILD FAILED:
	Ant Error Message:
/export/users/cc/cc-short/scripts/cc-exec-adaptor.xml:104: exec returned: 1

Date of build:	2008-02-20 08:41:42 +0600
Time to build:	1 minute 9 seconds
Last changed:	02/20/2008 08:36:22
Last log entry:	classlib

***********************************************************
Errors/Warnings:	(3)
            
svn: PROPFIND request failed on '/repos/asf/harmony/enhanced/drlvm/trunk'
svn: PROPFIND of '/repos/asf/harmony/enhanced/drlvm/trunk': 504 Gateway Time-out (http://svn.apache.org)
The execution FAILED with the following exception:
exec returned: 1

***********************************************************
Unit Tests: (0)
        
No Tests Run: This project doesn't have any tests

***********************************************************
Modifications since last successful build:	(1)
            
add cc-classlib log20080220083622Lbuild.634 02/20/2008 08:36:22classlib

begin 644 execution_log.zip
M4$L#! H    ( 'I%5#C#"9=L[    &$!   2    97AE8W5T:6]N7VQO9RYH
M=&ULC9!!2P,Q$(7O^15SD=7#-A44),8%H58*HD5Z*Q[B9K8)9I.83+JNO][=
M>A?G.//QYKTG#?6ND>]!CXV,"1NI(-/H\*[J@J<ZVV\4<+,\NZT:5J)6A'4^
M>L%@GCU^8?L&\P*VKR_;]>9Y!0D_"V:"3EF'&H*'BB>,(7.5.VY4ZH,?.7JC
M?(N:Z^2./:=4_$?UAVKH_B\CX'IY!8^3UT&-L+,]UJ$0G!NB*#B?A!<JJM;@
M(J3#!6,[@S#_+&0GM^O[S=/#"@9+!FBZ=,&Y,%A_F)@6X\P(-N-34BK)HQ9P
MR217C>2G!OEOF_Q4[0]02P$"% ,*    " !Z150XPPF7;.P   !A 0  $@  
M            I($     97AE8W5T:6]N7VQO9RYH=&UL4$L%!@     !  $ 
*0    !P!      $! 
end


Mime
View raw message